program: Orca
programVersion: 5.0.2
elementType: O O O C C C C C C C C C C C C C C C C C C C C C C H H H H H H H H H H H H H H H H H H H H H H H H H H
charge: 0
multiplicity: 1
keywords: wb97x-d3
keywords: def2-TZVPP
keywords: def2/J RIJCOSX
keywords: DEFGRID2
keywords: scfconv7
keywords: smallprint printgap noloewdin
keywords: NOSOSCF
formula: C22H26O3
InChI: InChI=1/C22H26O3/c1-15(2)10-19-20(22(19,3)4)21(23)25-14-17-12-18(24-13-17)11-16-8-6-5-7-9-16/h5-10,12-13,19-20H,11,14H2,1-4H3
51 atoms
O  2.117212 2.049961 -0.1657
O  2.168381 0.522886 1.464806
O  -1.904885 0.986739 -1.491915
C  4.931542 -0.329255 0.327084
C  3.939576 -1.007793 -0.552106
C  3.818715 0.499712 -0.278036
C  4.985923 -0.625963 1.805733
C  6.296591 -0.056776 -0.262595
C  2.939466 -1.97673 -0.04441
C  2.644029 0.993268 0.458749
C  1.784463 -2.236122 -0.663027
C  0.81844 -3.248254 -0.131427
C  1.37203 -1.505722 -1.91139
C  0.85989 2.562216 0.302397
C  -0.278808 1.733922 -0.179474
C  -0.84799 0.55441 0.403772
C  -0.965388 1.937652 -1.329165
C  -1.828636 0.144306 -0.434473
C  -2.825582 -0.956237 -0.367378
C  -4.165477 -0.459484 0.122175
C  -5.091898 0.086468 -0.762042
C  -4.475129 -0.499232 1.47869
C  -6.302486 0.583927 -0.298461
C  -5.685295 -0.004987 1.944526
C  -6.603077 0.540029 1.056242
H  4.271145 -1.200723 -1.570039
H  4.110836 1.136572 -1.105067
H  5.669002 -1.459257 1.982945
H  5.372667 0.234205 2.355622
H  4.027562 -0.890075 2.242576
H  6.24651 0.140356 -1.334472
H  6.76416 0.808208 0.212566
H  6.95717 -0.913683 -0.114863
H  3.179621 -2.516732 0.866448
H  1.184108 -3.733105 0.773947
H  0.61413 -4.025352 -0.872923
H  -0.144656 -2.783568 0.0999
H  0.447378 -1.907305 -2.326401
H  2.133763 -1.566121 -2.692182
H  1.205979 -0.442227 -1.721077
H  0.800935 3.565058 -0.117714
H  0.859894 2.655275 1.38902
H  -0.567633 0.081201 1.330993
H  -0.890968 2.690598 -2.099282
H  -2.441452 -1.721555 0.308512
H  -2.931874 -1.423792 -1.349786
H  -4.86876 0.121476 -1.822075
H  -3.7621 -0.921746 2.177445
H  -7.013265 1.005956 -0.997786
H  -5.911819 -0.047288 3.002474
H  -7.547424 0.926652 1.417617
elementType: O C H
totalener: -1079.74904237 hartree
nucrepener: 2165.46759028 hartree
electener: -3245.21663265 hartree
oneelecener: -5770.50876569 hartree
twoeener: 2525.29213305 hartree
cpcmener: -0.02551842 hartree
kineticenergy: 1074.86116032 hartree
xcener: -106.461297008002 hartree
chargesum: -0.0000000
charge: -0.287249 -0.465919 -0.279435 0.130155 -0.025545 -0.100294 -0.297272 -0.263104 -0.258007 0.389793 -0.016243 -0.209050 -0.288656 0.065382 -0.072135 -0.331723 -0.033813 0.231766 -0.059555 0.055355 -0.208334 -0.203722 -0.154844 -0.149187 -0.172519 0.111572 0.090057 0.097699 0.099997 0.094002 0.085643 0.095164 0.093421 0.121310 0.089699 0.099941 0.078849 0.101824 0.113330 0.090078 0.117471 0.116947 0.156159 0.171488 0.111992 0.119090 0.138529 0.140504 0.156159 0.156279 0.156950
qa: -0.2872 -0.4659 -0.2794 0.1302 -0.0255 -0.1003 -0.2973 -0.2631 -0.2580 0.3898 -0.0162 -0.2091 -0.2887 0.0654 -0.0721 -0.3317 -0.0338 0.2318 -0.0596 0.0554 -0.2083 -0.2037 -0.1548 -0.1492 -0.1725 0.1116 0.0901 0.0977 0.1000 0.0940 0.0856 0.0952 0.0934 0.1213 0.0897 0.0999 0.0788 0.1018 0.1133 0.0901 0.1175 0.1169 0.1562 0.1715 0.1120 0.1191 0.1385 0.1405 0.1562 0.1563 0.1570
va: 2.1014 2.0223 2.2741 3.7659 3.8136 3.8306 3.8907 3.8977 3.8131 4.1070 3.6701 3.9148 3.9547 3.8716 3.6182 3.9592 3.9601 3.5670 3.7939 3.5947 3.9682 3.9417 3.9019 3.8983 3.9020 1.0058 1.0334 0.9988 1.0005 1.0185 1.0049 1.0025 1.0027 1.0013 1.0100 0.9954 0.9977 1.0054 1.0017 0.9994 0.9962 1.0071 1.0224 0.9957 1.0093 1.0086 1.0108 1.0040 0.9913 0.9912 0.9907
dispcorr: -0.026782940 hartree
energy: -1079.775825306351
dipole: 16.71661 -16.52698 0.18963 -11.76946 11.84970 0.08024 -0.34301 -0.45962 -0.80263
magnitude: 0.82862 au
magnitude: 2.10619 debye
