program: Orca
programVersion: 5.0.2
elementType: O O O C C C C C C C C C C C C C C C C C C C C C C H H H H H H H H H H H H H H H H H H H H H H H H H H
charge: 0
multiplicity: 1
keywords: wb97x-d3
keywords: def2-TZVPP
keywords: def2/J RIJCOSX
keywords: DEFGRID2
keywords: scfconv7
keywords: smallprint printgap noloewdin
keywords: NOSOSCF
formula: C22H26O3
InChI: InChI=1/C22H26O3/c1-15(2)10-19-20(22(19,3)4)21(23)25-14-17-12-18(24-13-17)11-16-8-6-5-7-9-16/h5-10,12-13,19-20H,11,14H2,1-4H3
51 atoms
O  1.905276 1.888362 -0.226451
O  1.10351 0.043882 -1.200449
O  -2.024785 3.564837 0.909305
C  2.308959 -1.274979 1.396566
C  3.250619 -1.541338 0.273679
C  2.769357 -0.11722 0.519782
C  0.880564 -1.756985 1.334128
C  2.871481 -1.276694 2.798076
C  2.867956 -2.340305 -0.918633
C  1.840907 0.565135 -0.39774
C  3.39737 -2.20394 -2.135908
C  2.973543 -3.081454 -3.273494
C  4.403852 -1.150117 -2.480552
C  0.993911 2.714473 -0.968651
C  -0.335237 2.790691 -0.304444
C  -1.36903 1.797766 -0.251099
C  -0.797127 3.835671 0.421378
C  -2.365851 2.319732 0.501209
C  -3.693953 1.799312 0.928026
C  -3.77723 0.306835 0.750998
C  -3.030152 -0.536357 1.572192
C  -4.570298 -0.256382 -0.241796
C  -3.073475 -1.911392 1.402211
C  -4.620032 -1.635192 -0.412578
C  -3.869968 -2.465528 0.406586
H  4.28852 -1.665298 0.57473
H  3.488406 0.547166 0.985258
H  0.812772 -2.766173 1.745877
H  0.237437 -1.114148 1.939025
H  0.46497 -1.787077 0.33039
H  2.859962 -2.286442 3.214362
H  3.90237 -0.920855 2.824766
H  2.282277 -0.638855 3.46018
H  2.121064 -3.114466 -0.76633
H  2.566209 -2.485691 -4.095205
H  2.213637 -3.803845 -2.975029
H  3.82206 -3.634743 -3.684885
H  3.957658 -0.39402 -3.133339
H  5.244207 -1.575388 -3.034793
H  4.80538 -0.636218 -1.608556
H  0.912194 2.362686 -1.997778
H  1.461422 3.697871 -0.989404
H  -1.365327 0.824702 -0.712775
H  -0.375532 4.799058 0.665073
H  -4.489947 2.288108 0.358009
H  -3.863871 2.062517 1.976569
H  -2.406425 -0.110581 2.349955
H  -5.154813 0.386768 -0.889399
H  -2.485822 -2.552556 2.04749
H  -5.244975 -2.058175 -1.188966
H  -3.905906 -3.539274 0.273569
elementType: O C H
totalener: -1079.74961563 hartree
nucrepener: 2177.65407194 hartree
electener: -3257.40368757 hartree
oneelecener: -5795.19956266 hartree
twoeener: 2537.79587509 hartree
cpcmener: -0.02530329 hartree
kineticenergy: 1074.85936949 hartree
xcener: -106.462372020297 hartree
chargesum: -0.0000000
charge: -0.288901 -0.469008 -0.280065 0.153923 -0.027379 -0.113774 -0.321626 -0.264017 -0.254521 0.411362 -0.028208 -0.225941 -0.269381 0.070495 -0.108494 -0.278439 -0.036694 0.188568 -0.020687 0.016522 -0.218388 -0.173561 -0.153710 -0.154386 -0.162681 0.112625 0.094977 0.104935 0.094845 0.099259 0.093297 0.086311 0.095234 0.121286 0.093660 0.087477 0.094824 0.100217 0.102914 0.093424 0.117888 0.114800 0.162380 0.174262 0.099465 0.109277 0.146638 0.138241 0.157084 0.156126 0.157544
qa: -0.2889 -0.4690 -0.2801 0.1539 -0.0274 -0.1138 -0.3216 -0.2640 -0.2545 0.4114 -0.0282 -0.2259 -0.2694 0.0705 -0.1085 -0.2784 -0.0367 0.1886 -0.0207 0.0165 -0.2184 -0.1736 -0.1537 -0.1544 -0.1627 0.1126 0.0950 0.1049 0.0948 0.0993 0.0933 0.0863 0.0952 0.1213 0.0937 0.0875 0.0948 0.1002 0.1029 0.0934 0.1179 0.1148 0.1624 0.1743 0.0995 0.1093 0.1466 0.1382 0.1571 0.1561 0.1575
va: 2.1170 2.0155 2.2776 3.7415 3.8458 3.8452 3.9029 3.8987 3.8487 4.0711 3.7165 3.9286 3.9454 3.8662 3.7220 3.9482 3.9702 3.6775 3.8181 3.6183 3.9184 3.9260 3.8672 3.9026 3.9011 1.0041 1.0301 0.9993 1.0012 1.0101 1.0021 1.0052 1.0020 0.9994 0.9958 1.0076 0.9968 0.9975 1.0005 1.0046 1.0070 0.9973 1.0140 0.9950 1.0068 1.0072 1.0002 1.0045 0.9901 0.9910 0.9901
dispcorr: -0.025506377 hartree
energy: -1079.775122010540
dipole: 15.40519 -14.94813 0.45706 -17.24649 17.53986 0.29337 -2.22495 2.72778 0.50282
magnitude: 0.74013 au
magnitude: 1.88127 debye
