program: Orca
programVersion: 5.0.2
elementType: O O O C C C C C C C C C C C C C C C C C C C C C C H H H H H H H H H H H H H H H H H H H H H H H H H H
charge: 0
multiplicity: 1
keywords: wb97x-d3
keywords: def2-TZVPP
keywords: def2/J RIJCOSX
keywords: DEFGRID2
keywords: scfconv7
keywords: smallprint printgap noloewdin
keywords: NOSOSCF
formula: C22H26O3
InChI: InChI=1/C22H26O3/c1-15(2)10-19-20(22(19,3)4)21(23)25-14-17-12-18(24-13-17)11-16-8-6-5-7-9-16/h5-10,12-13,19-20H,11,14H2,1-4H3
51 atoms
O  1.850524 1.93859 -0.306138
O  1.047098 0.110951 -1.313636
O  -2.03493 3.554849 1.036015
C  2.287526 -1.252239 1.243384
C  3.199447 -1.505643 0.093393
C  2.733461 -0.080297 0.377303
C  0.855615 -1.72634 1.212528
C  2.886718 -1.2829 2.629423
C  2.795536 -2.274446 -1.107279
C  1.791983 0.620967 -0.510035
C  3.44316 -2.217202 -2.272989
C  3.047581 -3.074335 -3.434338
C  4.608459 -1.291887 -2.486183
C  0.906272 2.777465 -0.990407
C  -0.394055 2.824728 -0.2689
C  -1.408973 1.813881 -0.180268
C  -0.836499 3.852198 0.492406
C  -2.37584 2.310005 0.626494
C  -3.672641 1.763541 1.112302
C  -3.744489 0.272378 0.920423
C  -4.537222 -0.286485 -0.075154
C  -2.987372 -0.573487 1.729456
C  -4.580856 -1.664112 -0.257107
C  -3.024503 -1.947418 1.548054
C  -3.824559 -2.497565 0.553017
H  4.245009 -1.633081 0.365841
H  3.467954 0.568234 0.840866
H  0.796975 -2.744805 1.603176
H  0.235415 -1.095407 1.852324
H  0.407259 -1.732035 0.222598
H  3.921137 -0.936561 2.633917
H  2.320845 -0.651056 3.316964
H  2.876472 -2.299571 3.028404
H  1.955858 -2.955621 -1.008431
H  2.746446 -2.462396 -4.289059
H  2.22036 -3.741363 -3.190324
H  3.885722 -3.687997 -3.775914
H  5.506529 -1.648692 -1.97407
H  4.407028 -0.287442 -2.107837
H  4.860707 -1.200633 -3.543218
H  0.786124 2.4537 -2.025162
H  1.366078 3.764984 -1.002627
H  -1.414711 0.846549 -0.653906
H  -0.419323 4.818644 0.731594
H  -4.503663 2.248116 0.590689
H  -3.791867 2.010263 2.171691
H  -5.128686 0.358646 -0.714353
H  -2.364173 -0.151832 2.509959
H  -5.206367 -2.083701 -1.034934
H  -2.432249 -2.590771 2.186796
H  -3.856423 -3.570378 0.411569
elementType: O C H
totalener: -1079.74901831 hartree
nucrepener: 2174.15550772 hartree
electener: -3253.90452603 hartree
oneelecener: -5788.17405867 hartree
twoeener: 2534.26953264 hartree
cpcmener: -0.02572883 hartree
kineticenergy: 1074.85465522 hartree
xcener: -106.460954349415 hartree
chargesum: 0.0000000
charge: -0.289168 -0.467559 -0.280173 0.147493 -0.038116 -0.090013 -0.318493 -0.262979 -0.249743 0.393851 -0.025269 -0.224070 -0.278479 0.071560 -0.107351 -0.280375 -0.036806 0.187631 -0.017009 0.015184 -0.172741 -0.217224 -0.155873 -0.156793 -0.160199 0.113895 0.094738 0.106113 0.095294 0.096086 0.086104 0.095835 0.093530 0.123582 0.095149 0.084852 0.097996 0.103692 0.096404 0.095869 0.117927 0.114480 0.162456 0.174359 0.099615 0.108999 0.138028 0.146468 0.156182 0.157424 0.157637
qa: -0.2892 -0.4676 -0.2802 0.1475 -0.0381 -0.0900 -0.3185 -0.2630 -0.2497 0.3939 -0.0253 -0.2241 -0.2785 0.0716 -0.1074 -0.2804 -0.0368 0.1876 -0.0170 0.0152 -0.1727 -0.2172 -0.1559 -0.1568 -0.1602 0.1139 0.0947 0.1061 0.0953 0.0961 0.0861 0.0958 0.0935 0.1236 0.0951 0.0849 0.0980 0.1037 0.0964 0.0959 0.1179 0.1145 0.1625 0.1744 0.0996 0.1090 0.1380 0.1465 0.1562 0.1574 0.1576
va: 2.1143 2.0158 2.2774 3.7760 3.8322 3.8423 3.8981 3.8958 3.8067 4.0915 3.7078 3.9240 3.9510 3.8663 3.7271 3.9481 3.9699 3.6811 3.8168 3.6151 3.9252 3.9129 3.9040 3.8661 3.8982 1.0005 1.0305 0.9992 1.0007 1.0111 1.0055 1.0021 1.0022 0.9989 0.9942 1.0090 0.9933 0.9970 0.9974 1.0048 1.0074 0.9972 1.0137 0.9949 1.0063 1.0074 1.0046 1.0008 0.9909 0.9900 0.9900
dispcorr: -0.025442207 hartree
energy: -1079.774460521413
dipole: 16.08674 -15.58788 0.49886 -17.60106 17.85663 0.25556 -2.63231 3.20561 0.57330
magnitude: 0.80178 au
magnitude: 2.03795 debye
