program: Orca
programVersion: 5.0.2
elementType: O O O C C C C C C C C C C C C C C C C C C C C C C H H H H H H H H H H H H H H H H H H H H H H H H H H
charge: 0
multiplicity: 1
keywords: wb97x-d3
keywords: def2-TZVPP
keywords: def2/J RIJCOSX
keywords: DEFGRID2
keywords: scfconv7
keywords: smallprint printgap noloewdin
keywords: NOSOSCF
formula: C22H26O3
InChI: InChI=1/C22H26O3/c1-15(2)10-19-20(22(19,3)4)21(23)25-14-17-12-18(24-13-17)11-16-8-6-5-7-9-16/h5-10,12-13,19-20H,11,14H2,1-4H3
51 atoms
O  2.012073 2.093752 -0.974848
O  2.386901 1.274145 1.068365
O  -2.292885 2.680022 -0.557367
C  4.004448 -0.966818 -0.344048
C  2.589533 -1.43615 -0.495225
C  2.973247 -0.000228 -0.882357
C  4.624892 -0.799737 1.021315
C  4.993816 -1.4644 -1.372712
C  1.715756 -1.741895 0.652073
C  2.448016 1.15584 -0.133582
C  0.89521 -2.794802 0.756646
C  0.083365 -3.002738 2.000564
C  0.715252 -3.859638 -0.283072
C  1.317045 3.230721 -0.431918
C  -0.114258 2.903656 -0.194584
C  -0.696564 2.161536 0.885622
C  -1.139245 3.1883 -1.032268
C  -2.016337 2.049805 0.609329
C  -3.123411 1.313047 1.267295
C  -3.534271 0.093504 0.471535
C  -4.854541 -0.092763 0.078722
C  -2.586949 -0.864071 0.113468
C  -5.224799 -1.212488 -0.657046
C  -2.952646 -1.980421 -0.622885
C  -4.275023 -2.158493 -1.011765
H  2.417916 -2.050043 -1.372193
H  3.017172 0.167937 -1.95215
H  5.394391 -0.025863 1.001893
H  3.920894 -0.545168 1.807241
H  5.110713 -1.734075 1.309478
H  5.833105 -0.772988 -1.474941
H  5.397903 -2.435398 -1.079149
H  4.537603 -1.580231 -2.357203
H  1.754598 -1.065384 1.497266
H  0.260502 -2.225624 2.744243
H  0.310675 -3.968123 2.461933
H  -0.986772 -3.015603 1.775647
H  1.2052 -4.786317 0.029747
H  1.111372 -3.596422 -1.262273
H  -0.342597 -4.101612 -0.408462
H  1.409679 4.003649 -1.194054
H  1.812048 3.589494 0.471087
H  -0.196743 1.753203 1.748862
H  -1.191008 3.729083 -1.965056
H  -3.987644 1.965238 1.416959
H  -2.78124 1.014488 2.260709
H  -5.60181 0.645199 0.346027
H  -1.55065 -0.733652 0.406058
H  -6.257085 -1.339552 -0.957736
H  -2.202962 -2.712302 -0.896975
H  -4.56032 -3.028059 -1.589985
elementType: O C H
totalener: -1079.75041795 hartree
nucrepener: 2186.74582616 hartree
electener: -3266.49624411 hartree
oneelecener: -5812.91969765 hartree
twoeener: 2546.42345354 hartree
cpcmener: -0.02408212 hartree
kineticenergy: 1074.85688711 hartree
xcener: -106.462596709065 hartree
chargesum: 0.0000000
charge: -0.286864 -0.474362 -0.277098 0.114446 0.041634 -0.106585 -0.283682 -0.265064 -0.280087 0.411371 -0.085433 -0.218153 -0.266288 0.072628 -0.079582 -0.310561 -0.039529 0.205374 -0.053079 0.007052 -0.168357 -0.176332 -0.151628 -0.166141 -0.179107 0.114897 0.094910 0.101265 0.096633 0.094973 0.093751 0.094432 0.086505 0.123366 0.091663 0.103742 0.082835 0.110819 0.094006 0.085988 0.116664 0.117620 0.161188 0.173398 0.102646 0.113564 0.137827 0.137157 0.155393 0.174507 0.155682
qa: -0.2869 -0.4744 -0.2771 0.1144 0.0416 -0.1066 -0.2837 -0.2651 -0.2801 0.4114 -0.0854 -0.2182 -0.2663 0.0726 -0.0796 -0.3106 -0.0395 0.2054 -0.0531 0.0071 -0.1684 -0.1763 -0.1516 -0.1661 -0.1791 0.1149 0.0949 0.1013 0.0966 0.0950 0.0938 0.0944 0.0865 0.1234 0.0917 0.1037 0.0828 0.1108 0.0940 0.0860 0.1167 0.1176 0.1612 0.1734 0.1026 0.1136 0.1378 0.1372 0.1554 0.1745 0.1557
va: 2.1209 2.0201 2.2772 3.7048 3.7322 3.8740 3.8990 3.9075 3.8125 4.0968 3.7772 3.9113 3.9308 3.8544 3.6761 3.9713 3.9748 3.6319 3.8263 3.6933 3.9140 3.9073 3.8967 3.8842 3.9378 1.0015 1.0295 0.9996 1.0145 1.0011 1.0023 1.0019 1.0052 1.0205 1.0076 0.9983 0.9986 0.9957 1.0113 1.0005 0.9969 1.0088 1.0182 0.9952 1.0117 1.0048 1.0034 1.0004 0.9910 0.9777 0.9930
dispcorr: -0.025794493 hartree
energy: -1079.776212444706
dipole: 13.17642 -13.15456 0.02187 -21.22496 20.78313 -0.44184 2.58085 -3.26441 -0.68356
magnitude: 0.81422 au
magnitude: 2.06958 debye
