program: Gaussian 09
title: 000067858
version: EM64L-G09RevD.01
frameworkgroup: C1[X(C16H23FO)]
method: RPBEPBE
basis: SDD
operation: Freq
keyword: #p
keyword: freq=noraman
keyword: PBEPBE/SDD
title: #p freq=noraman PBEPBE/SDD
converged: YES YES NO NO
title: Mulliken charges:
elementType: F O C C C C C C C C C C C C C C C C H H H H H H H H H H H H H H H H H H H H H H H
charge: -0.246238 -0.219230 -0.384518 -0.381950 -0.370915 -0.372547 -0.387957 -0.382406 -0.530951 -0.399200 0.115531 -0.215629 0.284369 -0.343913 -0.348771 -0.249235 -0.230728 -0.224685 0.197249 0.197314 0.192695 0.192635 0.187825 0.187903 0.197677 0.197731 0.218695 0.218308 0.194414 0.194423 0.235080 0.234902 0.216783 0.216740 0.193583 0.193450 0.246540 0.278160 0.230114 0.233355 0.233397
chargesum: 0.00000
title: Mulliken charges with hydrogens summed into heavy atoms:
elementType: F O C C C C C C C C C C C C C C C C
charge: -0.246238 -0.219230 0.010044 0.003380 0.004813 0.022861 0.049046 0.006431 -0.060969 0.034323 0.115531 0.171404 0.284369 -0.097372 -0.070610 -0.019121 0.002627 0.008712
polarizability: 2.50771097e+02 9.94579864e+00 1.68430064e+02 -4.72100323e-02 -1.76809733e-02 1.08113097e+02
1716.lowfreq: -0.0011 -0.0004 0.0011 3.7137 4.0048 9.9144 17.1702 24.6261 35.7203
frequency: 16.4848 24.6254 35.4534 42.5279 62.0175 69.0305 78.5810 95.8212 117.7900 129.7999 130.9817 144.8367 152.9025 153.8265 165.8886 217.0878 280.0548 299.7478 362.6851 400.6267 403.8784 415.7642 456.6222 474.3941 510.9607 567.1847 613.3651 647.9823 697.4528 721.1516 726.4535 744.3754 765.1124 778.9824 788.0573 828.4897 859.7683 882.9387 928.8537 939.5235 955.3599 964.4903 989.8583 991.6447 997.9261 1002.9258 1010.3504 1014.6990 1025.9250 1047.5912 1052.3586 1078.0204 1080.8497 1081.5706 1089.2094 1096.8687 1107.4031 1147.8848 1172.7812 1187.4814 1195.6926 1196.3868 1220.0320 1229.2609 1252.5910 1262.0171 1276.8150 1283.0276 1284.9202 1290.0750 1298.5374 1301.4103 1310.2479 1319.0401 1340.8563 1357.7371 1359.1243 1362.8423 1384.0038 1387.2889 1433.3523 1436.6324 1461.1929 1462.9560 1465.3616 1470.2323 1472.1050 1477.7286 1479.0180 1485.5175 1490.7260 1570.6007 1598.9364 1612.6650 2948.4449 2952.0300 2955.4710 2957.4265 2960.2487 2967.4861 2985.7760 2991.5877 2993.2041 2995.7007 3000.4685 3001.1368 3002.6954 3021.0508 3037.9217 3048.7169 3059.0991 3078.8171 3128.1718 3138.3355 3149.7689 3158.7815 3169.1571
redmass: 5.3547 5.6953 3.6537 2.3791 3.8294 5.3612 1.7091 3.1441 1.7649 2.7346 5.1740 5.9788 2.0680 2.4585 2.5834 4.2288 5.2484 4.9784 4.2511 2.8128 4.9547 3.2115 4.1784 3.6326 3.5540 2.2488 6.4274 6.3934 1.8330 1.0767 1.0950 1.1746 1.3901 5.5957 1.2584 1.2996 1.2486 1.3240 8.3310 1.3251 1.3481 5.7046 6.2424 1.3755 5.2974 4.3175 1.2812 1.2111 2.1720 3.3274 3.3432 2.4675 1.9971 2.0464 2.0171 1.3879 4.1327 1.3091 1.0717 1.1342 1.6165 1.4734 1.5748 1.4032 1.4562 1.2810 1.0927 1.4512 1.0667 1.1066 1.1074 1.1114 1.4374 1.3617 1.4932 1.5600 1.7081 1.6618 1.3081 9.5020 1.2484 1.8326 1.0749 1.0699 1.0766 1.0857 1.0921 1.2052 1.8465 1.1011 1.1000 6.8501 6.8179 6.5900 1.0590 1.0589 1.0588 1.0599 1.0595 1.0588 1.0968 1.0988 1.0593 1.0603 1.0999 1.0560 1.0991 1.1045 1.1047 1.1052 1.1033 1.1101 1.0850 1.0880 1.0923 1.0960 1.1013
irintensity: 0.7381 0.1502 2.1842 0.0049 0.1685 2.1646 1.1851 4.3804 0.2564 0.1135 1.1200 0.1705 0.1734 0.0781 0.8993 1.8481 16.4985 0.3722 0.6359 0.0322 1.2345 1.0960 0.8631 3.3385 11.2965 5.4757 0.2097 10.2125 46.0126 28.5484 0.0300 26.1288 24.0184 0.9894 11.0649 0.0065 0.5415 0.1739 66.5350 1.7873 0.3920 48.3957 1.8859 0.5412 18.7122 0.7925 0.3714 0.0273 1.0030 0.2367 19.7128 1.2171 0.1677 3.6822 12.3476 0.2205 4.7653 0.7914 3.6981 25.7842 0.2243 6.1900 98.6894 0.0909 34.1285 0.2633 0.8782 60.2753 0.7340 0.0387 0.0941 0.0222 14.1708 14.5372 29.5198 12.4074 0.2961 5.6515 16.6514 2.5044 8.5771 26.8351 0.4796 0.1560 0.7248 0.7364 0.0991 2.5923 0.4066 3.6459 26.6374 88.2935 40.2864 11.8381 5.4812 2.0724 4.5845 28.5449 3.6037 129.4560 3.4762 0.3992 1.8932 28.5956 9.8243 90.5935 1.1504 0.0206 76.1120 22.5155 92.9968 101.4528 0.1596 6.5026 17.8026 23.5373 21.6047
temp: 298.150 k
press: 1.00000 atm
elementType: 9 8 6 6 6 6 6 6 6 6 6 6 6 6 6 6 6 6 1 1 1 1 1 1 1 1 1 1 1 1 1 1 1 1 1 1 1 1 1 1 1
symmnumber: 1
zpe: 923264.1 jmol-1
zpe.correction: 0.351653 hartree
zpe.thermalcorrener: 0.371443 hartree
zpe.thermalcorrenthalpy: 0.372387 hartree
zpe.thermalcorrgfe: 0.299317 hartree
zpe.sumelectzpe: -797.180978 hartree
zpe.sumelectthermal: -797.161188 hartree
zpe.sumelectthermalent: -797.160244 hartree
zpe.sumelectthermalfe: -797.233314 hartree
dipole: 3.4013 4.0992 0.0170
dipole: 5.3266
quadrupole: -132.8011 -110.1510 -109.9613
quadrupole: 1.6934 -0.1857 -0.0172
quadrupole: -15.1633 7.4868 7.6765 1.6934 -0.1857 -0.0172
hfenergy: -797.5326309 hartree
pointgroup: C01 [X(C16H23F1O1)]
dipole: 1.3388947 1.6121433 -0.0083334 debye
polarizability: 250.7799737|9.9087349|168.4152803|-0.0802859|-0.5976918|108.1190046 unknown
InChI: InChI=1S/C16H23FO/c17-14-10-5-3-1-2-4-9-13-16(18)15-11-7-6-8-12-15/h6-8,11-12H,1-5,9-10,13-14H2
charge 0 multiplicity 1
41 atoms
F  -9.700197 -0.09939 -0.00916
O  2.919867 -2.035691 0.025573
C  -2.108333 -0.506247 0.005903
C  -3.349659 0.413617 0.002521
C  -0.772101 0.269967 0.003926
C  -4.683847 -0.365407 0.00261
C  0.461327 -0.659137 0.009281
C  -5.92494 0.555297 -0.0002
C  1.78739 0.122991 0.004743
C  -7.256186 -0.234711 -0.002113
C  3.029601 -0.77376 0.012976
C  -8.465451 0.696184 -0.003393
C  4.391165 -0.129335 0.006025
C  4.570893 1.280428 -0.009291
C  5.537276 -0.970938 0.014965
C  5.868775 1.8352 -0.015688
C  6.832395 -0.41739 0.008703
C  7.001861 0.988687 -0.006741
H  -2.14372 -1.17446 -0.879567
H  -2.144365 -1.168906 0.8955
H  -3.314336 1.080706 0.88938
H  -3.312287 1.076941 -0.887085
H  -0.736652 0.931661 -0.88748
H  -0.738399 0.939368 0.889611
H  -4.720233 -1.03181 -0.884007
H  -4.721916 -1.028693 0.891494
H  0.432202 -1.322343 0.894831
H  0.432183 -1.332332 -0.868754
H  -5.884291 1.219113 -0.889123
H  -5.887338 1.22041 0.887881
H  1.834822 0.800266 0.883572
H  1.83637 0.787229 -0.883824
H  -7.303601 -0.890428 -0.892684
H  -7.305672 -0.891387 0.88763
H  -8.502737 1.32784 0.904358
H  -8.497032 1.332262 -0.908293
H  3.703857 1.949001 -0.01629
H  5.378016 -2.054428 0.026629
H  5.99864 2.922924 -0.027602
H  7.709118 -1.074226 0.015713
H  8.008932 1.420628 -0.01173
