program: Orca
programVersion: 5.0.2
elementType: O O O C C C C C C C C C C C C C C C C C C C C C C H H H H H H H H H H H H H H H H H H H H H H H H H H
charge: 0
multiplicity: 1
keywords: wb97x-d3
keywords: def2-TZVPP
keywords: def2/J RIJCOSX
keywords: DEFGRID2
keywords: scfconv7
keywords: smallprint printgap noloewdin
keywords: NOSOSCF
formula: C22H26O3
InChI: InChI=1/C22H26O3/c1-15(2)10-19-20(22(19,3)4)21(23)25-14-17-12-18(24-13-17)11-16-8-6-5-7-9-16/h5-10,12-13,19-20H,11,14H2,1-4H3
51 atoms
O  2.291282 1.522034 0.229746
O  2.138592 2.069452 -1.928879
O  -1.844363 1.855481 1.427465
C  3.523605 -1.103309 -0.453068
C  2.109525 -1.326291 -0.891188
C  2.874538 -0.10026 -1.384446
C  3.866852 -0.788906 0.983454
C  4.574238 -1.964883 -1.117469
C  0.917961 -1.18937 -0.011292
C  2.406522 1.263837 -1.065211
C  0.594432 -2.017319 0.985151
C  -0.663846 -1.824313 1.775327
C  1.43156 -3.186145 1.400727
C  1.614375 2.722389 0.644051
C  0.148283 2.482295 0.679688
C  -0.772588 2.440811 -0.418333
C  -0.566185 2.114126 1.768566
C  -1.962021 2.045919 0.091895
C  -3.262528 1.695953 -0.533303
C  -3.479283 0.200243 -0.508145
C  -4.366692 -0.380617 0.390626
C  -2.744453 -0.625623 -1.356352
C  -4.523877 -1.760753 0.437969
C  -2.897571 -2.003153 -1.310798
C  -3.789176 -2.575429 -0.411105
H  1.992601 -2.073384 -1.673624
H  3.194127 -0.158231 -2.418797
H  3.035368 -0.39864 1.562387
H  4.203954 -1.702827 1.476434
H  4.688355 -0.0724 1.04233
H  4.669926 -2.921303 -0.598593
H  4.332121 -2.177413 -2.159852
H  5.552163 -1.479194 -1.096785
H  0.221878 -0.389662 -0.248905
H  -1.297334 -2.714262 1.732673
H  -1.250921 -0.976692 1.42167
H  -0.436708 -1.657812 2.832196
H  1.728428 -3.10073 2.44903
H  2.33382 -3.302118 0.80291
H  0.8581 -4.113627 1.320079
H  1.882605 3.560712 0.00118
H  1.995555 2.927841 1.642931
H  -0.570743 2.663233 -1.453952
H  -0.306067 2.001088 2.809873
H  -3.250806 2.060067 -1.561747
H  -4.085466 2.203816 -0.024412
H  -4.942514 0.249168 1.058636
H  -2.044168 -0.186315 -2.0579
H  -5.220789 -2.198309 1.14164
H  -2.320601 -2.631014 -1.977995
H  -3.910262 -3.650571 -0.374203
elementType: O C H
totalener: -1079.74671338 hartree
nucrepener: 2270.70016665 hartree
electener: -3350.44688003 hartree
oneelecener: -5980.75231793 hartree
twoeener: 2630.30543790 hartree
cpcmener: -0.02522526 hartree
kineticenergy: 1074.86924356 hartree
xcener: -106.465761082859 hartree
chargesum: 0.0000000
charge: -0.258222 -0.475417 -0.272419 0.098037 -0.009856 -0.106291 -0.281777 -0.273938 -0.243205 0.392284 -0.005996 -0.245463 -0.267950 0.050390 -0.058026 -0.302545 -0.049392 0.189432 -0.041794 0.046752 -0.167671 -0.217499 -0.153946 -0.154936 -0.172392 0.107238 0.093203 0.094863 0.092312 0.109518 0.090689 0.086683 0.098304 0.104644 0.104286 0.056442 0.111937 0.101182 0.088760 0.108091 0.122712 0.111844 0.156612 0.172608 0.115163 0.107650 0.137424 0.143792 0.155613 0.154387 0.155882
qa: -0.2582 -0.4754 -0.2724 0.0980 -0.0099 -0.1063 -0.2818 -0.2739 -0.2432 0.3923 -0.0060 -0.2455 -0.2679 0.0504 -0.0580 -0.3025 -0.0494 0.1894 -0.0418 0.0468 -0.1677 -0.2175 -0.1539 -0.1549 -0.1724 0.1072 0.0932 0.0949 0.0923 0.1095 0.0907 0.0867 0.0983 0.1046 0.1043 0.0564 0.1119 0.1012 0.0888 0.1081 0.1227 0.1118 0.1566 0.1726 0.1152 0.1076 0.1374 0.1438 0.1556 0.1544 0.1559
va: 2.1135 2.0240 2.2665 3.6847 3.7853 3.8635 3.8687 3.9068 3.8499 4.1627 3.6015 3.9389 3.9348 3.8543 3.6157 3.9863 3.9269 3.6556 3.8106 3.5627 3.9275 3.8821 3.8881 3.8510 3.8582 1.0066 1.0267 1.0115 0.9981 1.0050 1.0037 1.0054 1.0011 0.9837 0.9977 1.0069 1.0015 0.9952 1.0058 1.0005 1.0084 1.0010 1.0204 0.9948 1.0089 1.0105 1.0050 1.0029 0.9910 0.9932 0.9914
dispcorr: -0.030893517 hartree
energy: -1079.777606892567
dipole: 10.92336 -10.92864 -0.00528 -18.62602 17.71670 -0.90932 5.45987 -4.46228 0.99759
magnitude: 1.34985 au
magnitude: 3.43104 debye
