program: Orca
programVersion: 5.0.2
elementType: O O O C C C C C C C C C C C C C C C C C C C C C C H H H H H H H H H H H H H H H H H H H H H H H H H H
charge: 0
multiplicity: 1
keywords: wb97x-d3
keywords: def2-TZVPP
keywords: def2/J RIJCOSX
keywords: DEFGRID2
keywords: scfconv7
keywords: smallprint printgap noloewdin
keywords: NOSOSCF
formula: C22H26O3
InChI: InChI=1/C22H26O3/c1-15(2)10-19-20(22(19,3)4)21(23)25-14-17-12-18(24-13-17)11-16-8-6-5-7-9-16/h5-10,12-13,19-20H,11,14H2,1-4H3
51 atoms
O  1.600565 1.819573 1.20946
O  1.832952 0.953689 -0.837415
O  -2.105245 2.479595 -1.06631
C  1.151068 -1.688154 0.717324
C  2.618687 -1.686315 0.464184
C  1.971676 -0.458694 1.094762
C  0.163659 -1.629226 -0.422612
C  0.644527 -2.495732 1.888702
C  3.215071 -1.678136 -0.892962
C  1.808361 0.805489 0.360777
C  4.462748 -1.276345 -1.145188
C  5.037706 -1.310856 -2.526712
C  5.347064 -0.718539 -0.06595
C  1.072252 3.036935 0.66222
C  -0.326987 2.808143 0.215356
C  -1.407199 2.332923 1.027042
C  -0.813781 2.869453 -1.044388
C  -2.458143 2.141661 0.1962
C  -3.804002 1.541795 0.397857
C  -3.758266 0.046461 0.179272
C  -3.632944 -0.81819 1.262799
C  -3.782809 -0.48929 -1.106234
C  -3.538517 -2.189922 1.068929
C  -3.683834 -1.859961 -1.303073
C  -3.561597 -2.715185 -0.215647
H  3.204325 -2.237347 1.197298
H  2.135067 -0.332027 2.158877
H  -0.106225 -2.643022 -0.725039
H  -0.75377 -1.126231 -0.108631
H  0.534428 -1.115649 -1.305578
H  1.364674 -2.524746 2.70761
H  -0.287665 -2.080943 2.278627
H  0.446005 -3.526247 1.585996
H  2.606339 -2.044508 -1.714025
H  5.938172 -1.929864 -2.565933
H  5.338913 -0.310092 -2.848839
H  4.329395 -1.699089 -3.258906
H  6.383669 -0.638734 -0.394132
H  5.335674 -1.328124 0.839472
H  5.024985 0.285114 0.225991
H  1.697784 3.417126 -0.147211
H  1.120969 3.748717 1.485701
H  -1.392016 2.13987 2.088706
H  -0.375238 3.159452 -1.986615
H  -4.528075 2.005283 -0.276488
H  -4.13295 1.757107 1.415279
H  -3.612169 -0.415832 2.26908
H  -3.883403 0.167977 -1.962207
H  -3.445766 -2.848225 1.923599
H  -3.706457 -2.26095 -2.30853
H  -3.486524 -3.78418 -0.368861
elementType: O C H
totalener: -1079.74727787 hartree
nucrepener: 2222.85975058 hartree
electener: -3302.60702846 hartree
oneelecener: -5885.75896684 hartree
twoeener: 2583.15193838 hartree
cpcmener: -0.02670790 hartree
kineticenergy: 1074.86508595 hartree
xcener: -106.462342514559 hartree
chargesum: -0.0000000
charge: -0.293593 -0.454588 -0.274250 0.169773 -0.043997 -0.067449 -0.281474 -0.275501 -0.253038 0.350673 -0.024948 -0.224254 -0.273790 0.093714 -0.058745 -0.353305 -0.031962 0.216428 -0.059223 0.037469 -0.171231 -0.185487 -0.171362 -0.156252 -0.170262 0.114587 0.091093 0.107709 0.045904 0.100472 0.089845 0.090118 0.095956 0.122902 0.094282 0.098387 0.085153 0.097859 0.097090 0.099866 0.113629 0.118960 0.156014 0.172866 0.113036 0.107100 0.137771 0.138388 0.156395 0.155247 0.156027
qa: -0.2936 -0.4546 -0.2742 0.1698 -0.0440 -0.0674 -0.2815 -0.2755 -0.2530 0.3507 -0.0249 -0.2243 -0.2738 0.0937 -0.0587 -0.3533 -0.0320 0.2164 -0.0592 0.0375 -0.1712 -0.1855 -0.1714 -0.1563 -0.1703 0.1146 0.0911 0.1077 0.0459 0.1005 0.0898 0.0901 0.0960 0.1229 0.0943 0.0984 0.0852 0.0979 0.0971 0.0999 0.1136 0.1190 0.1560 0.1729 0.1130 0.1071 0.1378 0.1384 0.1564 0.1552 0.1560
va: 2.0970 2.0293 2.2725 3.7236 3.8533 3.8156 3.9042 3.9031 3.8127 4.1473 3.7082 3.9260 3.9522 3.8594 3.6353 3.9780 3.9611 3.6051 3.8165 3.6143 3.8891 3.9310 3.8619 3.8844 3.8566 1.0014 1.0316 0.9970 1.0154 1.0230 1.0074 1.0040 1.0013 0.9998 0.9947 0.9932 1.0085 1.0051 0.9990 0.9962 1.0080 0.9907 1.0123 0.9974 1.0128 1.0111 1.0042 1.0109 0.9914 0.9918 0.9918
dispcorr: -0.027689112 hartree
energy: -1079.774966984774
dipole: 14.95577 -15.16483 -0.20907 -15.26903 15.11080 -0.15824 0.26459 0.86994 1.13453
magnitude: 1.16443 au
magnitude: 2.95975 debye
