program: Orca
programVersion: 5.0.2
elementType: O O O C C C C C C C C C C C C C C C C C C C C C C H H H H H H H H H H H H H H H H H H H H H H H H H H
charge: 0
multiplicity: 1
keywords: wb97x-d3
keywords: def2-TZVPP
keywords: def2/J RIJCOSX
keywords: DEFGRID2
keywords: scfconv7
keywords: smallprint printgap noloewdin
keywords: NOSOSCF
formula: C22H26O3
InChI: InChI=1/C22H26O3/c1-15(2)10-19-20(22(19,3)4)21(23)25-14-17-12-18(24-13-17)11-16-8-6-5-7-9-16/h5-10,12-13,19-20H,11,14H2,1-4H3
51 atoms
O  2.040497 2.217568 -0.244046
O  1.653561 0.741891 1.388841
O  -2.066901 3.62398 -0.969419
C  3.742854 -1.024864 -0.10627
C  2.435145 -1.389007 -0.735755
C  2.82542 0.078239 -0.601579
C  3.955054 -1.270631 1.365633
C  4.993265 -1.228377 -0.928089
C  1.314935 -2.000337 0.024989
C  2.116832 1.003314 0.302674
C  1.104787 -3.316699 0.115621
C  -0.059945 -3.866267 0.881865
C  1.986859 -4.347417 -0.519461
C  1.282916 3.232538 0.436089
C  -0.150452 3.163078 0.047641
C  -1.120813 2.170362 0.404719
C  -0.789247 4.014412 -0.788513
C  -2.261738 2.495378 -0.247547
C  -3.613507 1.87373 -0.303376
C  -3.568986 0.382804 -0.086673
C  -2.799332 -0.428637 -0.920349
C  -4.30388 -0.213757 0.931293
C  -2.768967 -1.802354 -0.740593
C  -4.280005 -1.592307 1.111643
C  -3.512203 -2.390107 0.277343
H  2.513675 -1.731597 -1.763951
H  3.137327 0.545663 -1.528168
H  3.046857 -1.200817 1.957175
H  4.358499 -2.275561 1.507733
H  4.680491 -0.566038 1.777746
H  5.371412 -2.246011 -0.808153
H  4.815457 -1.06459 -1.991848
H  5.784563 -0.54417 -0.614386
H  0.616577 -1.340641 0.526931
H  -0.661775 -3.080111 1.336783
H  0.278611 -4.533989 1.678804
H  -0.711297 -4.463397 0.23793
H  2.864151 -3.926066 -1.008859
H  1.433235 -4.925381 -1.266034
H  2.336354 -5.066891 0.226436
H  1.718648 4.176275 0.112741
H  1.41736 3.153751 1.514761
H  -0.981901 1.323434 1.056704
H  -0.470618 4.902928 -1.312335
H  -4.062787 2.090644 -1.277346
H  -4.271209 2.333798 0.440354
H  -2.216107 0.018636 -1.71712
H  -4.903373 0.403017 1.590895
H  -2.163484 -2.416406 -1.395778
H  -4.861643 -2.03973 1.90784
H  -3.490555 -3.463411 0.417362
elementType: O C H
totalener: -1079.74913541 hartree
nucrepener: 2182.71098176 hartree
electener: -3262.46011717 hartree
oneelecener: -5805.07165920 hartree
twoeener: 2542.61154203 hartree
cpcmener: -0.02370692 hartree
kineticenergy: 1074.85099602 hartree
xcener: -106.461470842257 hartree
chargesum: 0.0000000
charge: -0.287337 -0.475118 -0.278815 0.129939 -0.025954 -0.093523 -0.289496 -0.269950 -0.254708 0.397389 -0.027559 -0.261192 -0.257510 0.077294 -0.111885 -0.279463 -0.035020 0.197431 -0.036225 0.023144 -0.216117 -0.175760 -0.141099 -0.139506 -0.194127 0.113470 0.094896 0.100720 0.095474 0.103394 0.092155 0.088266 0.097012 0.121066 0.092257 0.106944 0.097916 0.085694 0.101859 0.095698 0.115278 0.117093 0.165333 0.174322 0.109970 0.099287 0.144768 0.138677 0.158077 0.156309 0.159235
qa: -0.2873 -0.4751 -0.2788 0.1299 -0.0260 -0.0935 -0.2895 -0.2700 -0.2547 0.3974 -0.0276 -0.2612 -0.2575 0.0773 -0.1119 -0.2795 -0.0350 0.1974 -0.0362 0.0231 -0.2161 -0.1758 -0.1411 -0.1395 -0.1941 0.1135 0.0949 0.1007 0.0955 0.1034 0.0922 0.0883 0.0970 0.1211 0.0923 0.1069 0.0979 0.0857 0.1019 0.0957 0.1153 0.1171 0.1653 0.1743 0.1100 0.0993 0.1448 0.1387 0.1581 0.1563 0.1592
va: 2.1239 2.0114 2.2820 3.6833 3.8079 3.9332 3.8925 3.9002 3.8261 4.0965 3.6678 3.9368 3.9441 3.8511 3.7343 3.9568 3.9641 3.6648 3.7966 3.6183 3.9270 3.9346 3.8266 3.8970 3.8763 1.0017 1.0290 1.0153 0.9999 1.0011 1.0031 1.0048 1.0025 1.0122 1.0015 1.0003 0.9913 1.0078 0.9981 0.9980 0.9974 1.0101 1.0126 0.9950 1.0071 1.0058 1.0004 1.0038 0.9898 0.9906 0.9897
dispcorr: -0.026242010 hartree
energy: -1079.775377422624
dipole: 14.63611 -14.31539 0.32073 -24.35352 24.15739 -0.19613 1.25826 -2.01602 -0.75775
magnitude: 0.84589 au
magnitude: 2.15007 debye
