program: Orca
programVersion: 5.0.2
elementType: O O O C C C C C C C C C C C C C C C C C C C C C C H H H H H H H H H H H H H H H H H H H H H H H H H H
charge: 0
multiplicity: 1
keywords: wb97x-d3
keywords: def2-TZVPP
keywords: def2/J RIJCOSX
keywords: DEFGRID2
keywords: scfconv7
keywords: smallprint printgap noloewdin
keywords: NOSOSCF
formula: C22H26O3
InChI: InChI=1/C22H26O3/c1-15(2)10-19-20(22(19,3)4)21(23)25-14-17-12-18(24-13-17)11-16-8-6-5-7-9-16/h5-10,12-13,19-20H,11,14H2,1-4H3
51 atoms
O  2.157007 1.992426 0.004064
O  1.786118 0.23588 1.338085
O  -1.996374 3.395703 -0.764766
C  4.247437 -1.009016 -0.123827
C  3.028577 -1.467864 -0.843714
C  3.22542 0.025215 -0.564558
C  4.45008 -1.327292 1.33642
C  5.54105 -0.987395 -0.903491
C  1.966341 -2.266582 -0.18544
C  2.325102 0.718665 0.370338
C  0.69699 -2.329819 -0.593572
C  -0.303323 -3.197701 0.104613
C  0.167336 -1.539926 -1.750979
C  1.266033 2.815231 0.771981
C  -0.118717 2.76393 0.232723
C  -1.062307 1.682323 0.281028
C  -0.747946 3.768422 -0.417945
C  -2.183228 2.123534 -0.338055
C  -3.516812 1.524428 -0.622503
C  -3.663402 0.131506 -0.072735
C  -3.721061 -0.085734 1.302779
C  -3.758841 -0.963423 -0.925683
C  -3.867619 -1.367689 1.811999
C  -3.914787 -2.248019 -0.419324
C  -3.968046 -2.453898 0.951311
H  3.177041 -1.69791 -1.895797
H  3.51641 0.623583 -1.420056
H  5.089463 -0.575368 1.803507
H  3.530452 -1.380595 1.912189
H  4.955804 -2.290594 1.434484
H  6.231763 -0.243828 -0.500825
H  6.034527 -1.960321 -0.851643
H  5.379845 -0.754563 -1.957165
H  2.261739 -2.867625 0.669665
H  -0.806051 -3.870874 -0.595087
H  -1.08652 -2.589186 0.564771
H  0.152893 -3.804223 0.887357
H  0.021589 -2.178839 -2.626053
H  0.821193 -0.721673 -2.047934
H  -0.811247 -1.11615 -1.518225
H  1.664029 3.826722 0.688328
H  1.296879 2.53285 1.825116
H  -0.919917 0.713625 0.731896
H  -0.443532 4.768478 -0.686764
H  -3.687014 1.512498 -1.703028
H  -4.295193 2.170233 -0.202146
H  -3.653274 0.755659 1.982761
H  -3.716146 -0.81144 -1.997931
H  -3.910241 -1.518686 2.8833
H  -3.990362 -3.087607 -1.098722
H  -4.086994 -3.454063 1.348227
elementType: O C H
totalener: -1079.74995656 hartree
nucrepener: 2208.50721624 hartree
electener: -3288.25717280 hartree
oneelecener: -5856.78280355 hartree
twoeener: 2568.52563074 hartree
cpcmener: -0.02438874 hartree
kineticenergy: 1074.86099608 hartree
xcener: -106.464985712228 hartree
chargesum: 0.0000000
charge: -0.290399 -0.471264 -0.281560 0.132838 -0.027061 -0.103060 -0.301280 -0.263316 -0.240486 0.399768 -0.010646 -0.226670 -0.272485 0.077311 -0.102367 -0.298083 -0.041312 0.208697 -0.012693 0.058372 -0.240883 -0.233719 -0.104604 -0.129501 -0.197901 0.113525 0.092839 0.099291 0.096189 0.099440 0.095167 0.093634 0.085715 0.119543 0.097707 0.071885 0.095688 0.116550 0.099604 0.066903 0.113398 0.114810 0.162892 0.173316 0.100279 0.111830 0.143866 0.141095 0.156661 0.155468 0.155008
qa: -0.2904 -0.4713 -0.2816 0.1328 -0.0271 -0.1031 -0.3013 -0.2633 -0.2405 0.3998 -0.0106 -0.2267 -0.2725 0.0773 -0.1024 -0.2981 -0.0413 0.2087 -0.0127 0.0584 -0.2409 -0.2337 -0.1046 -0.1295 -0.1979 0.1135 0.0928 0.0993 0.0962 0.0994 0.0952 0.0936 0.0857 0.1195 0.0977 0.0719 0.0957 0.1165 0.0996 0.0669 0.1134 0.1148 0.1629 0.1733 0.1003 0.1118 0.1439 0.1411 0.1567 0.1555 0.1550
va: 2.1142 2.0107 2.2761 3.7466 3.8287 3.8485 3.8978 3.8984 3.8410 4.0868 3.6687 3.9363 3.9368 3.8638 3.7438 3.9525 3.9785 3.6792 3.8266 3.5391 3.9470 3.9027 3.8316 3.8106 3.8818 1.0029 1.0304 1.0006 1.0165 0.9982 1.0025 1.0022 1.0048 1.0011 0.9945 0.9982 1.0131 1.0000 1.0068 1.0119 0.9976 1.0112 1.0106 0.9956 1.0117 1.0026 1.0019 1.0050 0.9895 0.9919 0.9926
dispcorr: -0.027771998 hartree
energy: -1079.777728558557
dipole: 12.18633 -12.04315 0.14317 -17.07239 17.28454 0.21215 -2.19008 1.45696 -0.73311
magnitude: 0.77651 au
magnitude: 1.97372 debye
