program: Orca
programVersion: 5.0.2
elementType: O O O C C C C C C C C C C C C C C C C C C C C C C H H H H H H H H H H H H H H H H H H H H H H H H H H
charge: 0
multiplicity: 1
keywords: wb97x-d3
keywords: def2-TZVPP
keywords: def2/J RIJCOSX
keywords: DEFGRID2
keywords: scfconv7
keywords: smallprint printgap noloewdin
keywords: NOSOSCF
formula: C22H26O3
InChI: InChI=1/C22H26O3/c1-15(2)10-19-20(22(19,3)4)21(23)25-14-17-12-18(24-13-17)11-16-8-6-5-7-9-16/h5-10,12-13,19-20H,11,14H2,1-4H3
51 atoms
O  2.189948 2.077154 0.363684
O  1.639028 0.151404 1.35537
O  -1.710835 2.38506 -1.606723
C  4.362689 -0.94541 0.385541
C  3.495575 -1.024653 -0.824329
C  3.5913 0.285296 -0.034482
C  4.007858 -1.710183 1.637612
C  5.854269 -0.864917 0.151906
C  2.241421 -1.816042 -0.855331
C  2.38325 0.78441 0.65512
C  1.184585 -1.530749 -1.615351
C  -0.052039 -2.373696 -1.577361
C  1.116555 -0.342316 -2.522999
C  0.988373 2.683512 0.844676
C  -0.198699 2.327992 0.017181
C  -1.128619 1.255788 0.207367
C  -0.611418 2.970278 -1.101293
C  -2.026413 1.34285 -0.802515
C  -3.221259 0.538822 -1.185758
C  -3.736571 -0.300191 -0.046687
C  -4.300135 0.308104 1.072091
C  -3.668773 -1.68661 -0.08679
C  -4.782059 -0.452578 2.123915
C  -4.147803 -2.45354 0.966946
C  -4.706064 -1.838399 2.074934
H  4.020782 -0.974634 -1.775067
H  4.174823 1.066544 -0.508175
H  4.441067 -1.224653 2.513521
H  2.939468 -1.794458 1.806866
H  4.427229 -2.716784 1.57979
H  6.353646 -0.357687 0.979286
H  6.283556 -1.864894 0.066329
H  6.097552 -0.323678 -0.763742
H  2.193921 -2.688371 -0.211746
H  -0.327886 -2.72632 -2.574551
H  -0.893827 -1.786671 -1.200267
H  0.062757 -3.242018 -0.929831
H  0.279171 0.301152 -2.243409
H  0.944162 -0.652424 -3.556998
H  2.017991 0.266442 -2.500848
H  1.182721 3.754306 0.788583
H  0.820156 2.426515 1.891694
H  -1.117212 0.521164 0.995197
H  -0.234052 3.83205 -1.628575
H  -2.982658 -0.103543 -2.039945
H  -4.009799 1.214084 -1.532766
H  -4.356469 1.389123 1.120174
H  -3.238706 -2.176725 -0.952023
H  -5.218712 0.035884 2.985206
H  -4.08381 -3.532626 0.918544
H  -5.081138 -2.433077 2.897383
totalener: -1079.72804438 hartree
nucrepener: 2212.97942644 hartree
electener: -3292.70747081 hartree
oneelecener: -5864.57186771 hartree
twoeener: 2571.86439690 hartree
kineticenergy: 1074.91165291 hartree
xcener: -106.469642642118 hartree
chargesum: 0.0000000
charge: -0.264434 -0.387711 -0.256837 0.140123 -0.054196 -0.121322 -0.280577 -0.245016 -0.179754 0.364271 0.008413 -0.167553 -0.260661 0.046874 -0.080156 -0.209998 -0.024245 0.159745 -0.095622 0.031264 -0.182492 -0.133369 -0.106108 -0.131877 -0.131045 0.092024 0.082482 0.084220 0.106773 0.085646 0.089967 0.087330 0.069916 0.081391 0.085730 0.031161 0.080698 0.087788 0.099805 0.086030 0.101346 0.109409 0.153914 0.135424 0.093458 0.112112 0.115751 0.117151 0.124333 0.123239 0.125187
qa: -0.2644 -0.3877 -0.2568 0.1401 -0.0542 -0.1213 -0.2806 -0.2450 -0.1798 0.3643 0.0084 -0.1676 -0.2607 0.0469 -0.0802 -0.2100 -0.0242 0.1597 -0.0956 0.0313 -0.1825 -0.1334 -0.1061 -0.1319 -0.1310 0.0920 0.0825 0.0842 0.1068 0.0856 0.0900 0.0873 0.0699 0.0814 0.0857 0.0312 0.0807 0.0878 0.0998 0.0860 0.1013 0.1094 0.1539 0.1354 0.0935 0.1121 0.1158 0.1172 0.1243 0.1232 0.1252
va: 2.1164 2.0961 2.2883 3.7326 3.9018 3.8303 3.9065 3.9038 3.8985 4.1520 3.7431 3.9289 3.9698 3.9174 3.6767 3.8939 3.9587 3.6040 3.8337 3.6223 4.0071 3.9531 3.9416 3.9963 3.9673 1.0050 1.0317 1.0051 1.0201 0.9978 1.0050 1.0048 1.0073 1.0137 0.9997 1.0143 1.0161 0.9855 1.0028 1.0109 0.9952 1.0065 1.0188 1.0086 1.0072 1.0083 1.0088 1.0027 0.9999 1.0023 0.9998
dispcorr: -0.028011229 hartree
energy: -1079.756055605589
dipole: 13.20993 -13.12374 0.08618 -12.99691 13.21482 0.21791 -3.03468 2.76291 -0.27177
magnitude: 0.35885 au
magnitude: 0.91211 debye
