program: Orca
programVersion: 5.0.2
elementType: O O O C C C C C C C C C C C C C C C C C C C C C C H H H H H H H H H H H H H H H H H H H H H H H H H H
charge: 0
multiplicity: 1
keywords: wb97x-d3
keywords: def2-TZVPP
keywords: def2/J RIJCOSX
keywords: DEFGRID2
keywords: scfconv7
keywords: smallprint printgap noloewdin
keywords: NOSOSCF
formula: C22H26O3
InChI: InChI=1/C22H26O3/c1-15(2)10-19-20(22(19,3)4)21(23)25-14-17-12-18(24-13-17)11-16-8-6-5-7-9-16/h5-10,12-13,19-20H,11,14H2,1-4H3
51 atoms
O  2.088898 1.835063 -1.035757
O  2.653914 1.270241 1.055624
O  -2.310164 2.423991 -0.427888
C  4.495198 -0.857753 -0.227396
C  3.149404 -1.490887 -0.11773
C  3.300576 -0.116479 -0.785137
C  5.233852 -0.365237 0.993268
C  5.424366 -1.428592 -1.275141
C  2.432406 -1.657551 1.166804
C  2.678091 1.048512 -0.127314
C  1.174634 -2.086929 1.284939
C  0.539911 -2.273525 2.629934
C  0.291357 -2.410158 0.11846
C  1.311384 2.932175 -0.552324
C  -0.095997 2.524084 -0.293829
C  -0.577464 1.540106 0.629203
C  -1.20006 3.014212 -0.903807
C  -1.924386 1.521412 0.498758
C  -2.981667 0.7083 1.148959
C  -3.800924 -0.125574 0.190642
C  -3.209004 -0.770803 -0.890791
C  -5.164977 -0.290579 0.39866
C  -3.962856 -1.570326 -1.735413
C  -5.923097 -1.088872 -0.445386
C  -5.32287 -1.733575 -1.515578
H  2.957961 -2.277857 -0.840877
H  3.211795 -0.110148 -1.865235
H  5.959495 0.398519 0.7086
H  4.59029 0.066613 1.752976
H  5.787888 -1.19167 1.442658
H  4.883274 -1.781122 -2.154353
H  6.146029 -0.680694 -1.607999
H  5.982733 -2.27482 -0.870702
H  2.981117 -1.432589 2.073776
H  1.227156 -2.046113 3.443587
H  0.186557 -3.299315 2.762555
H  -0.336602 -1.62879 2.741308
H  0.087289 -3.483064 0.067054
H  0.711124 -2.099877 -0.836404
H  -0.678576 -1.918971 0.224813
H  1.347128 3.684882 -1.340119
H  1.769105 3.356354 0.342692
H  0.010726 0.929765 1.295651
H  -1.339151 3.763935 -1.6663
H  -3.650836 1.35129 1.728632
H  -2.488951 0.055652 1.875594
H  -2.150123 -0.640807 -1.080997
H  -5.643213 0.2139 1.230131
H  -3.486437 -2.064097 -2.572332
H  -6.984579 -1.202522 -0.267924
H  -5.911482 -2.3545 -2.177938
totalener: -1079.72900295 hartree
nucrepener: 2175.74067805 hartree
electener: -3255.46968100 hartree
oneelecener: -5789.78276717 hartree
twoeener: 2534.31308618 hartree
kineticenergy: 1074.91125417 hartree
xcener: -106.469822632859 hartree
chargesum: -0.0000000
charge: -0.264822 -0.400686 -0.251166 0.135496 -0.058455 -0.076717 -0.281063 -0.239733 -0.131567 0.346503 -0.078026 -0.198787 -0.234076 0.067892 -0.055368 -0.270460 -0.038450 0.219736 -0.137297 0.106988 -0.196431 -0.147984 -0.141253 -0.121031 -0.131155 0.088618 0.079927 0.085394 0.103017 0.090464 0.070633 0.089863 0.089229 0.086692 0.082717 0.091907 0.070510 0.104688 0.084825 0.055264 0.091778 0.113260 0.160581 0.133652 0.097818 0.104562 0.130371 0.104302 0.121966 0.123082 0.122791
qa: -0.2648 -0.4007 -0.2512 0.1355 -0.0585 -0.0767 -0.2811 -0.2397 -0.1316 0.3465 -0.0780 -0.1988 -0.2341 0.0679 -0.0554 -0.2705 -0.0384 0.2197 -0.1373 0.1070 -0.1964 -0.1480 -0.1413 -0.1210 -0.1312 0.0886 0.0799 0.0854 0.1030 0.0905 0.0706 0.0899 0.0892 0.0867 0.0827 0.0919 0.0705 0.1047 0.0848 0.0553 0.0918 0.1133 0.1606 0.1337 0.0978 0.1046 0.1304 0.1043 0.1220 0.1231 0.1228
va: 2.1310 2.0762 2.3130 3.7601 3.8479 3.8688 3.9095 3.8966 3.8667 4.1581 3.7875 3.9375 3.9432 3.8979 3.7745 4.0073 3.9908 3.5908 3.9001 3.6199 4.0012 3.9940 4.0053 3.9621 3.9663 1.0031 1.0314 1.0036 1.0227 0.9982 1.0073 1.0054 1.0042 1.0160 1.0121 0.9983 1.0006 1.0025 1.0076 1.0074 0.9970 1.0085 1.0108 1.0079 1.0100 0.9979 0.9996 1.0109 1.0026 1.0007 1.0002
dispcorr: -0.026121773 hartree
energy: -1079.755124719498
dipole: 13.93715 -13.94458 -0.00743 -16.41116 16.11919 -0.29197 4.11612 -4.52826 -0.41215
magnitude: 0.50514 au
magnitude: 1.28396 debye
