program: Orca
programVersion: 5.0.2
elementType: O O O C C C C C C C C C C C C C C C C C C C C C C H H H H H H H H H H H H H H H H H H H H H H H H H H
charge: 0
multiplicity: 1
keywords: wb97x-d3
keywords: def2-TZVPP
keywords: def2/J RIJCOSX
keywords: DEFGRID2
keywords: scfconv7
keywords: smallprint printgap noloewdin
keywords: NOSOSCF
formula: C22H26O3
InChI: InChI=1/C22H26O3/c1-15(2)10-19-20(22(19,3)4)21(23)25-14-17-12-18(24-13-17)11-16-8-6-5-7-9-16/h5-10,12-13,19-20H,11,14H2,1-4H3
51 atoms
O  1.74171 -2.419943 -0.802536
O  2.04089 -1.582355 1.250057
O  -2.53678 -2.514768 -0.573356
C  3.842816 0.520607 -0.244009
C  2.469578 1.081047 -0.039372
C  2.635159 -0.290148 -0.676514
C  4.698716 1.057907 -1.365863
C  4.647315 0.123848 0.968845
C  1.909403 2.179688 -0.852593
C  2.131732 -1.469817 0.047147
C  1.389505 3.320493 -0.38698
C  0.825849 4.345571 -1.324364
C  1.313069 3.69565 1.061237
C  0.964047 -3.521402 -0.291059
C  -0.44464 -3.087807 -0.093127
C  -1.022186 -2.429929 1.041879
C  -1.416003 -3.110767 -1.03581
C  -2.285573 -2.095084 0.695512
C  -3.329232 -1.287547 1.371995
C  -3.427595 0.104332 0.785027
C  -2.297595 0.917087 0.701963
C  -4.642159 0.598839 0.323525
C  -2.382783 2.19469 0.169984
C  -4.731087 1.88015 -0.209043
C  -3.601703 2.681629 -0.287351
H  2.135178 1.044904 0.992053
H  2.480535 -0.328636 -1.749053
H  4.127873 1.272227 -2.26856
H  5.475916 0.338793 -1.630465
H  5.19344 1.980929 -1.057553
H  5.281471 0.959066 1.271754
H  5.302514 -0.720408 0.745655
H  4.031987 -0.142446 1.824684
H  1.921829 2.031884 -1.928649
H  1.343514 5.302433 -1.218536
H  0.89767 4.035356 -2.366569
H  -0.22712 4.539595 -1.101669
H  1.71546 2.941773 1.734891
H  1.862147 4.623466 1.240847
H  0.278679 3.891171 1.355849
H  1.407023 -3.92112 0.620745
H  1.030834 -4.286385 -1.062304
H  -0.55293 -2.220493 1.989392
H  -1.450388 -3.504918 -2.039816
H  -3.067803 -1.226462 2.430497
H  -4.301966 -1.781631 1.316835
H  -1.340598 0.547606 1.052827
H  -5.528017 -0.02261 0.379588
H  -1.49555 2.813119 0.112402
H  -5.684612 2.249091 -0.564321
H  -3.667522 3.678657 -0.703094
elementType: O C H
totalener: -1079.73933639 hartree
nucrepener: 2175.55137259 hartree
electener: -3255.29070899 hartree
oneelecener: -5790.58006644 hartree
twoeener: 2535.28935746 hartree
cpcmener: -0.02987108 hartree
kineticenergy: 1074.85519929 hartree
xcener: -106.461580800588 hartree
chargesum: 0.0000000
charge: -0.292518 -0.506088 -0.283663 0.122515 0.034388 -0.096802 -0.268261 -0.281612 -0.270794 0.420209 -0.070680 -0.219795 -0.253156 0.079603 -0.091783 -0.299033 -0.036841 0.197479 -0.041753 0.032834 -0.233351 -0.204529 -0.096321 -0.122845 -0.223563 0.095005 0.088280 0.089066 0.098452 0.097805 0.095122 0.099687 0.090506 0.121873 0.099457 0.091148 0.089722 0.091880 0.103562 0.092724 0.118261 0.122704 0.163621 0.178647 0.114849 0.103549 0.148990 0.142444 0.153999 0.158895 0.156112
qa: -0.2925 -0.5061 -0.2837 0.1225 0.0344 -0.0968 -0.2683 -0.2816 -0.2708 0.4202 -0.0707 -0.2198 -0.2532 0.0796 -0.0918 -0.2990 -0.0368 0.1975 -0.0418 0.0328 -0.2334 -0.2045 -0.0963 -0.1228 -0.2236 0.0950 0.0883 0.0891 0.0985 0.0978 0.0951 0.0997 0.0905 0.1219 0.0995 0.0911 0.0897 0.0919 0.1036 0.0927 0.1183 0.1227 0.1636 0.1786 0.1148 0.1035 0.1490 0.1424 0.1540 0.1589 0.1561
va: 2.1169 1.9873 2.2651 3.6890 3.7492 3.8776 3.9097 3.8960 3.8362 4.1195 3.7568 3.9148 3.9361 3.8353 3.6773 3.9641 3.9667 3.6339 3.8270 3.6627 3.9647 3.9429 3.8189 3.8638 3.9604 1.0302 1.0393 1.0048 1.0021 1.0018 1.0003 0.9993 1.0203 1.0098 0.9968 1.0080 0.9940 1.0084 0.9979 0.9953 1.0091 0.9969 1.0156 0.9930 1.0044 1.0129 1.0044 1.0029 0.9850 0.9897 0.9945
dispcorr: -0.025189613 hartree
energy: -1079.764526005557
dipole: 15.82555 -15.77630 0.04925 21.85831 -21.44361 0.41471 -0.70837 0.09692 -0.61144
magnitude: 0.74045 au
magnitude: 1.88208 debye
