program: Orca
programVersion: 5.0.2
elementType: O O O C C C C C C C C C C C C C C C C C C C C C C H H H H H H H H H H H H H H H H H H H H H H H H H H
charge: 0
multiplicity: 1
keywords: wb97x-d3
keywords: def2-TZVPP
keywords: def2/J RIJCOSX
keywords: DEFGRID2
keywords: scfconv7
keywords: smallprint printgap noloewdin
keywords: NOSOSCF
formula: C22H26O3
InChI: InChI=1/C22H26O3/c1-15(2)10-19-20(22(19,3)4)21(23)25-14-17-12-18(24-13-17)11-16-8-6-5-7-9-16/h5-10,12-13,19-20H,11,14H2,1-4H3
51 atoms
O  1.748001 -2.129262 -1.133176
O  2.541747 -1.93932 0.950407
O  -1.825711 -2.004669 1.356956
C  4.147762 0.53004 -0.121514
C  2.799938 0.991367 0.301576
C  2.927037 -0.199195 -0.651807
C  4.890189 1.33541 -1.162147
C  5.064611 -0.0995 0.897943
C  2.164934 2.246598 -0.164112
C  2.424298 -1.494682 -0.170982
C  0.842717 2.383158 -0.297784
C  0.221467 3.677847 -0.718939
C  -0.099146 1.242804 -0.025663
C  0.911145 -3.235264 -0.747041
C  -0.348441 -2.735888 -0.130074
C  -1.529955 -2.300937 -0.8159
C  -0.590674 -2.524931 1.18552
C  -2.396232 -1.87141 0.13115
C  -3.758594 -1.276964 0.070556
C  -3.722852 0.230912 0.157263
C  -3.809642 1.001685 -0.998531
C  -3.560156 0.874572 1.381467
C  -3.730282 2.386573 -0.936607
C  -3.475329 2.258751 1.446093
C  -3.558448 3.019829 0.286987
H  2.519944 0.687024 1.308304
H  2.687252 0.011727 -1.687401
H  5.62195 0.711134 -1.677406
H  5.431376 2.160165 -0.694373
H  4.226986 1.758226 -1.916935
H  4.532215 -0.592435 1.707182
H  5.691443 0.674848 1.344125
H  5.72918 -0.829476 0.432708
H  2.811738 3.094116 -0.371629
H  0.967609 4.447324 -0.916479
H  -0.382963 3.547404 -1.620019
H  -0.456972 4.053085 0.052007
H  -0.110167 0.967812 1.031886
H  -1.119691 1.493834 -0.309594
H  0.182152 0.346239 -0.580975
H  1.445993 -3.917763 -0.087205
H  0.703237 -3.760876 -1.676938
H  -1.704965 -2.315847 -1.880485
H  -0.013524 -2.704728 2.078517
H  -4.375339 -1.686613 0.874405
H  -4.218647 -1.581194 -0.869926
H  -3.94032 0.512781 -1.956876
H  -3.500007 0.292076 2.293185
H  -3.801974 2.969991 -1.845524
H  -3.345393 2.744732 2.404561
H  -3.493032 4.098886 0.337791
elementType: O C H
totalener: -1079.73765933 hartree
nucrepener: 2222.91495486 hartree
electener: -3302.65261419 hartree
oneelecener: -5885.43793895 hartree
twoeener: 2582.78532475 hartree
cpcmener: -0.02749207 hartree
kineticenergy: 1074.85338110 hartree
xcener: -106.463639691302 hartree
chargesum: -0.0000000
charge: -0.296079 -0.502962 -0.283918 0.182158 0.003373 -0.120720 -0.290919 -0.281841 -0.338734 0.391774 0.052511 -0.248711 -0.250246 0.090041 -0.073226 -0.349031 -0.014887 0.219844 -0.058775 0.046995 -0.181707 -0.220203 -0.134490 -0.129663 -0.205143 0.101163 0.096028 0.098817 0.100156 0.092835 0.089835 0.094580 0.099774 0.123885 0.096517 0.100760 0.100392 0.111326 0.034919 0.099692 0.119829 0.121127 0.159913 0.170095 0.117447 0.107687 0.140150 0.139738 0.157299 0.159320 0.161274
qa: -0.2961 -0.5030 -0.2839 0.1822 0.0034 -0.1207 -0.2909 -0.2818 -0.3387 0.3918 0.0525 -0.2487 -0.2502 0.0900 -0.0732 -0.3490 -0.0149 0.2198 -0.0588 0.0470 -0.1817 -0.2202 -0.1345 -0.1297 -0.2051 0.1012 0.0960 0.0988 0.1002 0.0928 0.0898 0.0946 0.0998 0.1239 0.0965 0.1008 0.1004 0.1113 0.0349 0.0997 0.1198 0.1211 0.1599 0.1701 0.1174 0.1077 0.1401 0.1397 0.1573 0.1593 0.1613
va: 2.0937 1.9903 2.2611 3.6965 3.8023 3.8167 3.9108 3.8769 3.9017 4.1484 3.6671 3.9127 3.9627 3.8106 3.6149 3.9720 3.9251 3.5686 3.8049 3.5774 3.8884 3.9328 3.8275 3.8424 3.8611 1.0273 1.0331 1.0029 0.9995 1.0015 1.0210 1.0006 0.9993 1.0037 1.0110 0.9944 0.9937 0.9952 1.0372 1.0141 1.0122 0.9937 1.0084 1.0059 1.0085 1.0113 1.0037 1.0127 0.9920 0.9894 0.9910
dispcorr: -0.029068468 hartree
energy: -1079.766727799374
dipole: 11.28094 -11.96206 -0.68112 16.20986 -15.73418 0.47568 -4.05832 2.91993 -1.13839
magnitude: 1.40930 au
magnitude: 3.58215 debye
