program: Orca
programVersion: 5.0.2
elementType: O O O C C C C C C C C C C C C C C C C C C C C C C H H H H H H H H H H H H H H H H H H H H H H H H H H
charge: 0
multiplicity: 1
keywords: wb97x-d3
keywords: def2-TZVPP
keywords: def2/J RIJCOSX
keywords: DEFGRID2
keywords: scfconv7
keywords: smallprint printgap noloewdin
keywords: NOSOSCF
formula: C22H26O3
InChI: InChI=1/C22H26O3/c1-15(2)10-19-20(22(19,3)4)21(23)25-14-17-12-18(24-13-17)11-16-8-6-5-7-9-16/h5-10,12-13,19-20H,11,14H2,1-4H3
51 atoms
O  1.652766 -2.157667 -0.125544
O  1.296568 -0.393434 1.203392
O  -2.556235 -2.90646 -1.129942
C  4.048834 0.517424 -0.034308
C  2.927574 1.26365 -0.690266
C  2.862298 -0.245648 -0.60349
C  5.349859 0.3423 -0.778779
C  4.235557 0.671673 1.454204
C  3.068689 1.907889 -2.015037
C  1.864548 -0.901617 0.261217
C  2.982204 3.220182 -2.254186
C  3.134858 3.765062 -3.64244
C  2.744814 4.258293 -1.200187
C  0.673292 -2.947428 0.576168
C  -0.703728 -2.692511 0.076137
C  -1.636004 -1.673931 0.467045
C  -1.323922 -3.406624 -0.89116
C  -2.740024 -1.847622 -0.297005
C  -4.037485 -1.127051 -0.410334
C  -4.214283 -0.132779 0.7035
C  -4.861598 -0.499946 1.879733
C  -3.709161 1.1593 0.590114
C  -5.007437 0.406443 2.920873
C  -3.84833 2.066956 1.631617
C  -4.498771 1.692943 2.800233
H  2.275818 1.774242 0.011583
H  3.076331 -0.78183 -1.521722
H  5.975171 1.230207 -0.66488
H  5.207879 0.170665 -1.845262
H  5.907354 -0.506564 -0.37874
H  4.664666 -0.230294 1.894892
H  3.312881 0.90062 1.982371
H  4.929961 1.491729 1.646693
H  3.2648 1.248141 -2.855753
H  3.301452 2.978081 -4.377681
H  2.244671 4.324305 -3.942212
H  3.971907 4.465614 -3.700184
H  3.560035 4.986287 -1.194908
H  1.832482 4.822344 -1.409447
H  2.663458 3.851349 -0.194556
H  0.751764 -2.785938 1.651737
H  0.960605 -3.977181 0.370404
H  -1.49774 -0.917888 1.222738
H  -1.025035 -4.267203 -1.469625
H  -4.856996 -1.850796 -0.397525
H  -4.089735 -0.618622 -1.378147
H  -5.257933 -1.503528 1.979931
H  -3.206248 1.459107 -0.321868
H  -5.517308 0.106556 3.827317
H  -3.454718 3.069777 1.527055
H  -4.611754 2.401018 3.610804
elementType: O C H
totalener: -1079.74064430 hartree
nucrepener: 2079.78525403 hartree
electener: -3159.52589833 hartree
oneelecener: -5599.28477963 hartree
twoeener: 2439.75888131 hartree
cpcmener: -0.02984444 hartree
kineticenergy: 1074.84187411 hartree
xcener: -106.458691429572 hartree
chargesum: -0.0000000
charge: -0.288715 -0.509817 -0.286079 0.136793 0.023694 -0.129653 -0.263570 -0.288838 -0.285234 0.443358 -0.034504 -0.225251 -0.254541 0.071762 -0.117109 -0.260724 -0.035167 0.168861 0.007127 -0.001366 -0.195920 -0.198504 -0.154869 -0.155790 -0.171975 0.092906 0.089854 0.095717 0.089514 0.098898 0.100282 0.091367 0.096288 0.124168 0.089634 0.094538 0.094051 0.096158 0.097287 0.090256 0.119569 0.122589 0.159834 0.179815 0.105175 0.107787 0.142574 0.144714 0.160760 0.160654 0.161643
qa: -0.2887 -0.5098 -0.2861 0.1368 0.0237 -0.1297 -0.2636 -0.2888 -0.2852 0.4434 -0.0345 -0.2253 -0.2545 0.0718 -0.1171 -0.2607 -0.0352 0.1689 0.0071 -0.0014 -0.1959 -0.1985 -0.1549 -0.1558 -0.1720 0.0929 0.0899 0.0957 0.0895 0.0989 0.1003 0.0914 0.0963 0.1242 0.0896 0.0945 0.0941 0.0962 0.0973 0.0903 0.1196 0.1226 0.1598 0.1798 0.1052 0.1078 0.1426 0.1447 0.1608 0.1607 0.1616
va: 2.1235 1.9907 2.2677 3.6648 3.7635 3.8951 3.9070 3.9015 3.8765 4.1153 3.7240 3.9228 3.9445 3.8369 3.7123 3.9561 3.9686 3.7193 3.8165 3.6217 3.9345 3.9202 3.8888 3.8892 3.8893 1.0299 1.0384 1.0030 1.0039 1.0023 0.9992 1.0194 1.0005 1.0078 1.0080 0.9956 0.9964 0.9973 0.9973 1.0082 1.0084 0.9978 1.0139 0.9924 1.0095 1.0034 1.0034 1.0031 0.9895 0.9898 0.9891
dispcorr: -0.022122847 hartree
energy: -1079.762767148683
dipole: 22.98463 -22.47506 0.50957 20.09685 -20.19955 -0.10270 -5.54125 4.89029 -0.65096
magnitude: 0.83304 au
magnitude: 2.11742 debye
