program: Orca
programVersion: 5.0.2
elementType: O O O C C C C C C C C C C C C C C C C C C C C C C H H H H H H H H H H H H H H H H H H H H H H H H H H
charge: 0
multiplicity: 1
keywords: wb97x-d3
keywords: def2-TZVPP
keywords: def2/J RIJCOSX
keywords: DEFGRID2
keywords: scfconv7
keywords: smallprint printgap noloewdin
keywords: NOSOSCF
formula: C22H26O3
InChI: InChI=1/C22H26O3/c1-15(2)10-19-20(22(19,3)4)21(23)25-14-17-12-18(24-13-17)11-16-8-6-5-7-9-16/h5-10,12-13,19-20H,11,14H2,1-4H3
51 atoms
O  1.696594 -2.124595 0.012238
O  1.176881 -1.150197 -1.935595
O  -2.377722 -2.731482 1.399888
C  1.742714 1.345014 -0.036246
C  2.747683 1.250471 -1.149289
C  2.464006 0.032747 -0.300725
C  2.095963 2.05086 1.250154
C  0.282953 1.483463 -0.396376
C  4.085095 1.869875 -1.072722
C  1.7219 -1.114127 -0.854637
C  4.723149 2.520442 -2.051201
C  6.100994 3.070263 -1.830868
C  4.174891 2.759229 -3.425368
C  0.835543 -3.246736 -0.262256
C  -0.562125 -2.932544 0.136075
C  -1.558222 -2.196959 -0.588387
C  -1.122826 -3.227115 1.332196
C  -2.635819 -2.101731 0.223977
C  -3.933416 -1.389768 0.10017
C  -3.917936 -0.10832 0.900448
C  -4.427405 -0.063266 2.194063
C  -3.333181 1.037557 0.367361
C  -4.353812 1.105588 2.942025
C  -3.258358 2.20616 1.111378
C  -3.768078 2.242719 2.403469
H  2.301446 1.216981 -2.137076
H  3.208084 -0.228044 0.444239
H  3.125112 1.879369 1.562269
H  1.447372 1.708735 2.058618
H  1.952244 3.128248 1.147159
H  0.040414 1.076476 -1.375859
H  0.004465 2.539143 -0.40545
H  -0.347593 0.986121 0.34357
H  4.603542 1.76117 -0.124213
H  6.47268 2.862064 -0.827833
H  6.810039 2.648024 -2.547857
H  6.120566 4.152749 -1.981357
H  4.243924 3.818601 -3.683358
H  4.766119 2.223362 -4.17233
H  3.136265 2.458768 -3.546763
H  1.233593 -4.056719 0.346245
H  0.909771 -3.543541 -1.308323
H  -1.483566 -1.792017 -1.584404
H  -0.763056 -3.767331 2.194295
H  -4.754226 -2.031781 0.428329
H  -4.09841 -1.171317 -0.955538
H  -4.88751 -0.946677 2.620643
H  -2.929277 1.013302 -0.63846
H  -4.753978 1.12649 3.947551
H  -2.801144 3.088588 0.682151
H  -3.710127 3.153023 2.985932
elementType: O C H
totalener: -1079.74068805 hartree
nucrepener: 2139.74586326 hartree
electener: -3219.48655131 hartree
oneelecener: -5718.99003096 hartree
twoeener: 2499.50347965 hartree
cpcmener: -0.02985123 hartree
kineticenergy: 1074.85912298 hartree
xcener: -106.462508972403 hartree
chargesum: -0.0000000
charge: -0.284968 -0.495923 -0.284439 0.132211 0.032146 -0.094727 -0.276626 -0.310043 -0.285420 0.418481 -0.051584 -0.219380 -0.255490 0.069824 -0.059796 -0.358308 -0.035223 0.219523 -0.045511 0.088587 -0.204382 -0.264253 -0.154862 -0.148268 -0.177498 0.089997 0.093237 0.091167 0.098103 0.097897 0.097388 0.105636 0.102293 0.120174 0.089104 0.093222 0.093817 0.094258 0.099121 0.091196 0.120929 0.121022 0.160891 0.178749 0.112703 0.113773 0.142263 0.155659 0.160008 0.162199 0.161124
qa: -0.2850 -0.4959 -0.2844 0.1322 0.0321 -0.0947 -0.2766 -0.3100 -0.2854 0.4185 -0.0516 -0.2194 -0.2555 0.0698 -0.0598 -0.3583 -0.0352 0.2195 -0.0455 0.0886 -0.2044 -0.2643 -0.1549 -0.1483 -0.1775 0.0900 0.0932 0.0912 0.0981 0.0979 0.0974 0.1056 0.1023 0.1202 0.0891 0.0932 0.0938 0.0943 0.0991 0.0912 0.1209 0.1210 0.1609 0.1787 0.1127 0.1138 0.1423 0.1557 0.1600 0.1622 0.1611
va: 2.1178 2.0052 2.2685 3.6768 3.7870 3.8137 3.9011 3.9114 3.8780 4.1749 3.7620 3.9198 3.9403 3.8419 3.6449 3.9775 3.9681 3.6219 3.8100 3.5257 3.9622 3.9223 3.8877 3.8666 3.9053 1.0326 1.0351 1.0063 1.0017 1.0016 1.0158 1.0010 0.9890 1.0106 1.0088 0.9957 0.9965 0.9975 0.9957 1.0094 0.9972 1.0076 1.0188 0.9926 1.0099 1.0089 1.0058 0.9945 0.9895 0.9889 0.9891
dispcorr: -0.024847356 hartree
energy: -1079.765535403075
dipole: 18.25446 -18.04769 0.20676 21.29811 -21.05900 0.23911 -5.91356 6.57196 0.65841
magnitude: 0.73036 au
magnitude: 1.85642 debye
