program: Orca
programVersion: 5.0.2
elementType: O O O C C C C C C C C C C C C C C C C C C C C C C H H H H H H H H H H H H H H H H H H H H H H H H H H
charge: 0
multiplicity: 1
keywords: wb97x-d3
keywords: def2-TZVPP
keywords: def2/J RIJCOSX
keywords: DEFGRID2
keywords: scfconv7
keywords: smallprint printgap noloewdin
keywords: NOSOSCF
formula: C22H26O3
InChI: InChI=1/C22H26O3/c1-15(2)10-19-20(22(19,3)4)21(23)25-14-17-12-18(24-13-17)11-16-8-6-5-7-9-16/h5-10,12-13,19-20H,11,14H2,1-4H3
51 atoms
O  1.497201 -2.29933 -0.908486
O  2.127231 -1.551806 1.103468
O  -2.15725 -2.399062 1.543666
C  3.849154 0.435281 -0.635714
C  2.617308 1.123933 -0.134419
C  2.48779 -0.207143 -0.844701
C  4.519643 0.957905 -1.882388
C  4.824082 -0.130542 0.367592
C  2.048394 2.331927 -0.778061
C  2.039477 -1.392577 -0.093918
C  2.046238 3.561906 -0.255331
C  1.404919 4.708437 -0.976588
C  2.669679 3.914148 1.060308
C  0.826678 -3.425728 -0.313957
C  -0.509705 -3.017363 0.191295
C  -1.649039 -2.650833 -0.597119
C  -0.880531 -2.839752 1.480123
C  -2.618376 -2.281512 0.270847
C  -3.979837 -1.715442 0.082592
C  -3.957065 -0.208034 0.184473
C  -3.803519 0.568706 -0.960972
C  -4.03369 0.426231 1.421765
C  -3.727208 1.952278 -0.87422
C  -3.954332 1.810079 1.51178
C  -3.7990 2.577191 0.364303
H  2.491165 1.065935 0.942483
H  2.122939 -0.162646 -1.865176
H  5.136988 0.182977 -2.340754
H  5.17262 1.798466 -1.637779
H  3.806383 1.299396 -2.632039
H  5.311192 -1.028726 -0.018892
H  4.364637 -0.380204 1.321778
H  5.60591 0.60548 0.567513
H  1.587529 2.189609 -1.751554
H  2.129997 5.501248 -1.178374
H  0.963331 4.403947 -1.925351
H  0.617082 5.160004 -0.367669
H  3.126804 3.065659 1.567399
H  3.44528 4.672362 0.921713
H  1.92987 4.352113 1.736123
H  1.435272 -3.874659 0.471875
H  0.737373 -4.148562 -1.123742
H  -1.726836 -2.656435 -1.673245
H  -0.36972 -2.990604 2.418311
H  -4.669287 -2.13654 0.818941
H  -4.339539 -2.015983 -0.902296
H  -3.744568 0.085883 -1.929899
H  -4.160711 -0.164088 2.322019
H  -3.611954 2.542151 -1.774812
H  -4.016174 2.290332 2.4802
H  -3.738706 3.655708 0.434357
elementType: O C H
totalener: -1079.73996879 hartree
nucrepener: 2126.45954457 hartree
electener: -3206.19951336 hartree
oneelecener: -5692.82383026 hartree
twoeener: 2486.62431690 hartree
cpcmener: -0.03129297 hartree
kineticenergy: 1074.83729177 hartree
xcener: -106.456089900647 hartree
chargesum: 0.0000000
charge: -0.292963 -0.503337 -0.284818 0.150299 0.006870 -0.130698 -0.263260 -0.294275 -0.281733 0.427551 -0.030765 -0.229430 -0.253993 0.099584 -0.080570 -0.350447 -0.021342 0.215679 -0.058799 0.056391 -0.205917 -0.208481 -0.151809 -0.154182 -0.182129 0.096144 0.089343 0.098599 0.095895 0.089993 0.101964 0.091597 0.095815 0.123687 0.094650 0.090139 0.094905 0.088960 0.097482 0.097196 0.118214 0.123490 0.164039 0.176973 0.114948 0.109560 0.144009 0.143140 0.160747 0.159784 0.161299
qa: -0.2930 -0.5033 -0.2848 0.1503 0.0069 -0.1307 -0.2633 -0.2943 -0.2817 0.4276 -0.0308 -0.2294 -0.2540 0.0996 -0.0806 -0.3504 -0.0213 0.2157 -0.0588 0.0564 -0.2059 -0.2085 -0.1518 -0.1542 -0.1821 0.0961 0.0893 0.0986 0.0959 0.0900 0.1020 0.0916 0.0958 0.1237 0.0947 0.0901 0.0949 0.0890 0.0975 0.0972 0.1182 0.1235 0.1640 0.1770 0.1149 0.1096 0.1440 0.1431 0.1607 0.1598 0.1613
va: 2.1162 1.9963 2.2676 3.6618 3.7629 3.9056 3.9063 3.9000 3.8729 4.1394 3.7097 3.9247 3.9446 3.8109 3.6326 4.0055 3.9489 3.6078 3.8192 3.5801 3.9393 3.9571 3.8835 3.8917 3.8972 1.0275 1.0399 1.0024 1.0030 1.0029 0.9986 1.0186 1.0006 1.0073 0.9963 1.0079 0.9956 1.0081 0.9971 0.9977 1.0108 0.9927 1.0073 0.9984 1.0104 1.0101 1.0031 1.0089 0.9895 0.9899 0.9895
dispcorr: -0.022693294 hartree
energy: -1079.762662080458
dipole: 18.39832 -18.50418 -0.10586 21.66625 -21.34270 0.32354 -5.18778 4.02245 -1.16533
magnitude: 1.21403 au
magnitude: 3.08583 debye
