program: Orca
programVersion: 5.0.2
elementType: O O O C C C C C C C C C C C C C C C C C C C C C C H H H H H H H H H H H H H H H H H H H H H H H H H H
charge: 0
multiplicity: 1
keywords: wb97x-d3
keywords: def2-TZVPP
keywords: def2/J RIJCOSX
keywords: DEFGRID2
keywords: scfconv7
keywords: smallprint printgap noloewdin
keywords: NOSOSCF
formula: C22H26O3
InChI: InChI=1/C22H26O3/c1-15(2)10-19-20(22(19,3)4)21(23)25-14-17-12-18(24-13-17)11-16-8-6-5-7-9-16/h5-10,12-13,19-20H,11,14H2,1-4H3
51 atoms
O  1.746669 -1.870337 -0.044824
O  2.04731 -0.091956 1.281015
O  -2.698411 -1.748934 -0.356864
C  4.753573 0.090431 -0.317799
C  3.783252 1.11008 -0.829921
C  3.350936 -0.342394 -0.710894
C  5.864171 -0.410018 -1.21013
C  5.159752 0.157289 1.134205
C  3.887014 1.719801 -2.169075
C  2.334245 -0.720829 0.285784
C  3.624267 2.991617 -2.490268
C  3.768322 3.467125 -3.905278
C  3.173289 4.04852 -1.528864
C  0.708382 -2.388889 0.806138
C  -0.626445 -1.843897 0.443093
C  -1.153605 -0.526788 0.659798
C  -1.611564 -2.532552 -0.178519
C  -2.407491 -0.523175 0.152816
C  -3.465051 0.51626 0.084139
C  -4.673925 0.158826 0.914645
C  -4.609009 0.215122 2.305232
C  -5.859667 -0.248663 0.313941
C  -5.70917 -0.123255 3.078709
C  -6.963993 -0.589164 1.086212
C  -6.89203 -0.527126 2.470312
H  3.375396 1.74866 -0.054004
H  3.296654 -0.900594 -1.638805
H  6.700192 0.292086 -1.20893
H  5.55118 -0.554316 -2.243117
H  6.238382 -1.36827 -0.845421
H  5.361745 -0.839056 1.532235
H  4.414688 0.631177 1.768974
H  6.079462 0.738028 1.225551
H  4.199407 1.056511 -2.970345
H  2.828535 3.884035 -4.276513
H  4.508352 4.268713 -3.974665
H  4.07341 2.668048 -4.580573
H  3.127496 3.716498 -0.492966
H  3.842379 4.912658 -1.571002
H  2.180518 4.416788 -1.804568
H  0.9490 -2.203967 1.853249
H  0.727725 -3.465621 0.645732
H  -0.666811 0.309403 1.134582
H  -1.679011 -3.549827 -0.53218
H  -3.765239 0.679194 -0.95437
H  -3.029143 1.452222 0.437336
H  -3.689323 0.529648 2.785346
H  -5.923363 -0.295214 -0.766706
H  -5.64537 -0.069392 4.157885
H  -7.880931 -0.902453 0.603831
H  -7.751658 -0.790007 3.072901
elementType: O C H
totalener: -1079.74174413 hartree
nucrepener: 2036.89880391 hartree
electener: -3116.64054804 hartree
oneelecener: -5513.27597571 hartree
twoeener: 2396.63542767 hartree
cpcmener: -0.03006624 hartree
kineticenergy: 1074.84138241 hartree
xcener: -106.458717568140 hartree
chargesum: -0.0000000
charge: -0.289641 -0.511620 -0.287922 0.098215 0.038209 -0.087440 -0.275257 -0.277685 -0.281309 0.439264 -0.052405 -0.217314 -0.253988 0.073285 -0.094959 -0.292433 -0.035171 0.188465 -0.049339 0.031843 -0.195290 -0.188036 -0.164452 -0.161087 -0.172275 0.092279 0.089907 0.097726 0.090442 0.097202 0.100197 0.091084 0.097118 0.121156 0.092956 0.093957 0.088615 0.091188 0.095280 0.097892 0.119316 0.120164 0.162402 0.179132 0.109863 0.118776 0.146495 0.143110 0.160555 0.160007 0.161526
qa: -0.2896 -0.5116 -0.2879 0.0982 0.0382 -0.0874 -0.2753 -0.2777 -0.2813 0.4393 -0.0524 -0.2173 -0.2540 0.0733 -0.0950 -0.2924 -0.0352 0.1885 -0.0493 0.0318 -0.1953 -0.1880 -0.1645 -0.1611 -0.1723 0.0923 0.0899 0.0977 0.0904 0.0972 0.1002 0.0911 0.0971 0.1212 0.0930 0.0940 0.0886 0.0912 0.0953 0.0979 0.1193 0.1202 0.1624 0.1791 0.1099 0.1188 0.1465 0.1431 0.1606 0.1600 0.1615
va: 2.1204 1.9845 2.2677 3.6893 3.7726 3.8286 3.9136 3.9016 3.8812 4.1138 3.7637 3.9188 3.9394 3.8368 3.6859 4.0098 3.9653 3.6761 3.8083 3.5967 3.9319 3.9402 3.8994 3.8909 3.8899 1.0315 1.0349 1.0012 1.0065 1.0014 0.9991 1.0191 0.9998 1.0109 0.9961 0.9961 1.0088 1.0099 0.9970 0.9961 1.0096 0.9995 1.0176 0.9928 1.0065 1.0062 1.0023 1.0036 0.9902 0.9900 0.9892
dispcorr: -0.021473227 hartree
energy: -1079.763217358769
dipole: 25.57441 -25.15473 0.41968 15.18710 -15.30412 -0.11702 -8.87065 8.14801 -0.72264
magnitude: 0.84382 au
magnitude: 2.14482 debye
