program: Orca
programVersion: 5.0.2
elementType: O O O C C C C C C C C C C C C C C C C C C C C C C H H H H H H H H H H H H H H H H H H H H H H H H H H
charge: 0
multiplicity: 1
keywords: wb97x-d3
keywords: def2-TZVPP
keywords: def2/J RIJCOSX
keywords: DEFGRID2
keywords: scfconv7
keywords: smallprint printgap noloewdin
keywords: NOSOSCF
formula: C22H26O3
InChI: InChI=1/C22H26O3/c1-15(2)10-19-20(22(19,3)4)21(23)25-14-17-12-18(24-13-17)11-16-8-6-5-7-9-16/h5-10,12-13,19-20H,11,14H2,1-4H3
51 atoms
O  1.192248 -1.466815 -1.235157
O  0.88606 0.725129 -1.567896
O  -2.359964 -2.255857 1.354389
C  3.513337 0.818122 0.185816
C  3.807912 1.160558 -1.243869
C  3.037441 -0.103765 -0.926166
C  4.619607 0.278346 1.06008
C  2.525806 1.670528 0.944348
C  5.161766 1.049384 -1.824082
C  1.608503 -0.202177 -1.274994
C  5.784791 2.005112 -2.519768
C  7.152345 1.779156 -3.088976
C  5.178037 3.349366 -2.811111
C  -0.184585 -1.751462 -1.541568
C  -1.048218 -1.652134 -0.335508
C  -1.457317 -0.479385 0.383517
C  -1.625776 -2.693874 0.306649
C  -2.247213 -0.902661 1.396544
C  -3.013224 -0.181335 2.444525
C  -4.496089 -0.195223 2.159361
C  -5.032135 0.676173 1.214009
C  -5.34154 -1.093175 2.801619
C  -6.387499 0.6544 0.920336
C  -6.699946 -1.118231 2.509056
C  -7.22627 -0.244685 1.567867
H  3.196711 1.963939 -1.641632
H  3.585749 -1.036144 -1.005106
H  5.287009 -0.399765 0.530359
H  4.20468 -0.2661 1.909988
H  5.222638 1.097881 1.45602
H  1.968104 1.073558 1.66909
H  1.809795 2.176472 0.30074
H  3.062579 2.4414 1.500289
H  5.678662 0.106156 -1.6729
H  7.872308 2.485584 -2.667597
H  7.517087 0.770058 -2.89807
H  7.159667 1.942789 -4.169901
H  5.954115 4.100713 -2.962638
H  4.581925 3.324245 -3.727319
H  4.52923 3.706115 -2.011612
H  -0.184247 -2.772183 -1.920197
H  -0.535921 -1.099498 -2.341577
H  -1.206624 0.546787 0.169787
H  -1.606754 -3.759077 0.134978
H  -2.647042 0.845809 2.474001
H  -2.816264 -0.618697 3.426482
H  -4.381604 1.379022 0.70613
H  -4.937219 -1.774722 3.540526
H  -6.790666 1.341247 0.187287
H  -7.346811 -1.82084 3.018546
H  -8.284218 -0.261781 1.340644
elementType: O C H
totalener: -1079.74067904 hartree
nucrepener: 2038.76671092 hartree
electener: -3118.50738997 hartree
oneelecener: -5516.95195005 hartree
twoeener: 2398.44456009 hartree
cpcmener: -0.02976262 hartree
kineticenergy: 1074.84834225 hartree
xcener: -106.459322177966 hartree
chargesum: 0.0000000
charge: -0.286611 -0.505144 -0.287510 0.117775 0.049899 -0.122567 -0.269533 -0.285838 -0.313284 0.436352 -0.013592 -0.221984 -0.281936 0.075360 -0.086671 -0.309218 -0.036584 0.202077 -0.053620 0.044410 -0.200686 -0.197131 -0.160192 -0.160070 -0.175493 0.093542 0.092047 0.089581 0.098553 0.097343 0.099153 0.092195 0.098358 0.122017 0.093880 0.087308 0.097231 0.095805 0.107010 0.098029 0.117627 0.120372 0.161371 0.179606 0.115689 0.112848 0.146893 0.143220 0.160662 0.160389 0.161066
qa: -0.2866 -0.5051 -0.2875 0.1178 0.0499 -0.1226 -0.2695 -0.2858 -0.3133 0.4364 -0.0136 -0.2220 -0.2819 0.0754 -0.0867 -0.3092 -0.0366 0.2021 -0.0536 0.0444 -0.2007 -0.1971 -0.1602 -0.1601 -0.1755 0.0935 0.0920 0.0896 0.0986 0.0973 0.0992 0.0922 0.0984 0.1220 0.0939 0.0873 0.0972 0.0958 0.1070 0.0980 0.1176 0.1204 0.1614 0.1796 0.1157 0.1128 0.1469 0.1432 0.1607 0.1604 0.1611
va: 2.1216 1.9924 2.2688 3.6797 3.7546 3.8816 3.9060 3.9054 3.8968 4.1262 3.7033 3.9253 3.9435 3.8422 3.6794 4.0030 3.9678 3.6629 3.8120 3.5844 3.9355 3.9512 3.8981 3.8901 3.8928 1.0293 1.0365 1.0055 1.0020 1.0018 1.0000 1.0169 1.0013 1.0088 0.9948 1.0093 0.9935 1.0008 0.9938 0.9998 0.9990 1.0079 1.0184 0.9925 1.0082 1.0084 1.0021 1.0046 0.9900 0.9898 0.9894
dispcorr: -0.022128797 hartree
energy: -1079.762807841650
dipole: 29.11134 -28.41152 0.69982 14.37768 -14.70049 -0.32281 -4.39388 4.69127 0.29739
magnitude: 0.82607 au
magnitude: 2.09971 debye
