program: Orca
programVersion: 5.0.2
elementType: O O O C C C C C C C C C C C C C C C C C C C C C C H H H H H H H H H H H H H H H H H H H H H H H H H H
charge: 0
multiplicity: 1
keywords: wb97x-d3
keywords: def2-TZVPP
keywords: def2/J RIJCOSX
keywords: DEFGRID2
keywords: scfconv7
keywords: smallprint printgap noloewdin
keywords: NOSOSCF
formula: C22H26O3
InChI: InChI=1/C22H26O3/c1-15(2)10-19-20(22(19,3)4)21(23)25-14-17-12-18(24-13-17)11-16-8-6-5-7-9-16/h5-10,12-13,19-20H,11,14H2,1-4H3
51 atoms
O  2.071936 -1.987946 0.384377
O  2.174532 -2.101413 -1.843201
O  -2.116627 -2.083045 -0.746681
C  3.989947 0.428304 0.159812
C  2.575045 0.86916 0.278471
C  2.956744 -0.141674 -0.798824
C  4.992101 1.354994 -0.487261
C  4.594799 -0.418123 1.252396
C  2.072878 2.207407 -0.114132
C  2.384146 -1.496685 -0.811726
C  0.801585 2.412299 -0.471559
C  0.278053 3.774584 -0.800304
C  -0.180179 1.275742 -0.55013
C  1.192429 -3.127987 0.430248
C  -0.2126 -2.683964 0.224387
C  -1.098437 -2.151513 1.217487
C  -0.888612 -2.611529 -0.946831
C  -2.239584 -1.806386 0.577819
C  -3.507721 -1.179475 1.034325
C  -3.564497 0.292417 0.700549
C  -4.013627 0.72706 -0.543478
C  -3.126545 1.237531 1.623956
C  -4.022295 2.079573 -0.858484
C  -3.133652 2.590032 1.312153
C  -3.580991 3.015315 0.068012
H  2.036352 0.420098 1.109474
H  3.027219 0.257661 -1.804256
H  5.393298 2.058634 0.244684
H  4.560824 1.933169 -1.304457
H  5.830882 0.786151 -0.892122
H  5.333416 -1.112456 0.847754
H  3.859972 -0.992234 1.811256
H  5.110407 0.227359 1.966009
H  2.75945 3.047701 -0.070252
H  1.050446 4.540633 -0.732745
H  -0.142453 3.80108 -1.808702
H  -0.534373 4.052193 -0.122927
H  0.190369 0.464011 -1.180535
H  -0.374187 0.84462 0.434812
H  -1.137633 1.59815 -0.958323
H  1.327495 -3.543339 1.426687
H  1.494685 -3.882863 -0.294576
H  -0.903335 -2.047317 2.27346
H  -0.644125 -2.898344 -1.957358
H  -3.578677 -1.316992 2.113737
H  -4.36005 -1.699149 0.589528
H  -4.364969 0.004649 -1.270743
H  -2.77454 0.911113 2.595529
H  -4.376036 2.403156 -1.828959
H  -2.790017 3.312199 2.041589
H  -3.58817 4.069525 -0.176659
elementType: O C H
totalener: -1079.73618719 hartree
nucrepener: 2233.71229992 hartree
electener: -3313.44848711 hartree
oneelecener: -5906.76191497 hartree
twoeener: 2593.31342786 hartree
cpcmener: -0.02915073 hartree
kineticenergy: 1074.86210329 hartree
xcener: -106.465273753096 hartree
chargesum: -0.0000000
charge: -0.284791 -0.506121 -0.283949 0.158393 0.027905 -0.105034 -0.291142 -0.273941 -0.360727 0.388871 0.079497 -0.239298 -0.341981 0.077193 -0.050687 -0.355681 -0.023204 0.210825 -0.047070 0.057976 -0.200588 -0.221636 -0.133250 -0.126960 -0.211198 0.099532 0.092729 0.099997 0.091858 0.099116 0.100481 0.091841 0.093949 0.125263 0.093830 0.101337 0.094482 0.113294 0.104686 0.102964 0.114925 0.122091 0.159782 0.169809 0.109874 0.116119 0.140012 0.140599 0.157287 0.159214 0.161527
qa: -0.2848 -0.5061 -0.2839 0.1584 0.0279 -0.1050 -0.2911 -0.2739 -0.3607 0.3889 0.0795 -0.2393 -0.3420 0.0772 -0.0507 -0.3557 -0.0232 0.2108 -0.0471 0.0580 -0.2006 -0.2216 -0.1333 -0.1270 -0.2112 0.0995 0.0927 0.1000 0.0919 0.0991 0.1005 0.0918 0.0939 0.1253 0.0938 0.1013 0.0945 0.1133 0.1047 0.1030 0.1149 0.1221 0.1598 0.1698 0.1099 0.1161 0.1400 0.1406 0.1573 0.1592 0.1615
va: 2.0979 1.9845 2.2586 3.7326 3.7457 3.8220 3.9126 3.8823 3.8854 4.1515 3.5986 3.9166 3.9888 3.8185 3.6006 3.9719 3.9289 3.5831 3.7997 3.5485 3.9383 3.8922 3.8505 3.8057 3.8598 1.0262 1.0300 0.9993 1.0020 1.0023 0.9997 1.0148 1.0006 1.0049 1.0098 0.9939 0.9945 1.0017 0.9902 1.0110 0.9977 1.0122 1.0084 1.0056 1.0110 1.0082 1.0099 1.0046 0.9906 0.9893 0.9899
dispcorr: -0.029536955 hartree
energy: -1079.765724145636
dipole: 11.54312 -11.82728 -0.28416 16.19329 -15.58738 0.60591 2.99086 -1.44376 1.54710
magnitude: 1.68565 au
magnitude: 4.28457 debye
