program: Orca
programVersion: 5.0.2
elementType: O O O C C C C C C C C C C C C C C C C C C C C C C H H H H H H H H H H H H H H H H H H H H H H H H H H
charge: 0
multiplicity: 1
keywords: wb97x-d3
keywords: def2-TZVPP
keywords: def2/J RIJCOSX
keywords: DEFGRID2
keywords: scfconv7
keywords: smallprint printgap noloewdin
keywords: NOSOSCF
formula: C22H26O3
InChI: InChI=1/C22H26O3/c1-15(2)10-19-20(22(19,3)4)21(23)25-14-17-12-18(24-13-17)11-16-8-6-5-7-9-16/h5-10,12-13,19-20H,11,14H2,1-4H3
51 atoms
O  1.661557 -1.833192 -0.664811
O  1.953363 -1.700109 1.548668
O  -2.56262 -2.361321 -0.613029
C  1.2603 1.256999 -0.145333
C  2.400488 0.939972 -1.073509
C  2.316191 0.237699 0.257113
C  1.266015 2.557939 0.61834
C  -0.12914 0.803886 -0.52625
C  3.508312 1.898494 -1.297141
C  1.965451 -1.182777 0.45187
C  3.758261 2.555096 -2.433937
C  4.909992 3.507986 -2.538409
C  2.936423 2.425349 -3.679275
C  1.007099 -3.116489 -0.562082
C  -0.436289 -2.90624 -0.276201
C  -1.063328 -2.666076 0.98944
C  -1.400026 -2.709556 -1.206422
C  -2.346409 -2.32676 0.72781
C  -3.429999 -1.779554 1.58603
C  -3.326825 -0.271465 1.611913
C  -3.869061 0.498496 0.586323
C  -2.602402 0.362973 2.617223
C  -3.684489 1.874752 0.563715
C  -2.418449 1.739123 2.598331
C  -2.955548 2.498977 1.567403
H  2.114896 0.346286 -1.935186
H  2.997725 0.59073 1.024616
H  0.88649 3.367906 -0.008182
H  2.25961 2.841648 0.96337
H  0.617102 2.489518 1.494199
H  -0.700933 0.503505 0.354556
H  -0.131116 -0.023918 -1.232655
H  -0.664762 1.629764 -0.998078
H  4.161555 2.084306 -0.449023
H  5.583438 3.222859 -3.350637
H  4.561434 4.518178 -2.76817
H  5.492165 3.553947 -1.618363
H  2.099717 1.737886 -3.579723
H  2.531807 3.397286 -3.970215
H  3.55099 2.087392 -4.516444
H  1.496011 -3.742031 0.183917
H  1.149974 -3.57682 -1.537513
H  -0.611366 -2.717683 1.966515
H  -1.401915 -2.779337 -2.283063
H  -3.312616 -2.179581 2.59356
H  -4.409106 -2.096149 1.220723
H  -4.438274 0.021053 -0.202511
H  -2.172079 -0.226791 3.418262
H  -4.109065 2.460164 -0.241724
H  -1.852111 2.217287 3.38726
H  -2.809294 3.571063 1.547645
elementType: O C H
totalener: -1079.73643782 hartree
nucrepener: 2215.31399166 hartree
electener: -3295.05042948 hartree
oneelecener: -5870.04007307 hartree
twoeener: 2574.98964359 hartree
cpcmener: -0.03050113 hartree
kineticenergy: 1074.86347640 hartree
xcener: -106.464749803597 hartree
chargesum: 0.0000000
charge: -0.279091 -0.497487 -0.278630 0.224944 0.031817 -0.147217 -0.289937 -0.323466 -0.306687 0.421477 -0.029784 -0.227304 -0.253444 0.055307 -0.072515 -0.312555 -0.036498 0.200351 -0.043477 0.044060 -0.204017 -0.168711 -0.156793 -0.175076 -0.171596 0.102665 0.093971 0.097366 0.093977 0.094701 0.058090 0.102964 0.108248 0.122415 0.093997 0.094462 0.089293 0.088559 0.096121 0.097527 0.121658 0.121014 0.158432 0.178242 0.108066 0.112161 0.140552 0.141560 0.159427 0.160609 0.160252
qa: -0.2791 -0.4975 -0.2786 0.2249 0.0318 -0.1472 -0.2899 -0.3235 -0.3067 0.4215 -0.0298 -0.2273 -0.2534 0.0553 -0.0725 -0.3126 -0.0365 0.2004 -0.0435 0.0441 -0.2040 -0.1687 -0.1568 -0.1751 -0.1716 0.1027 0.0940 0.0974 0.0940 0.0947 0.0581 0.1030 0.1082 0.1224 0.0940 0.0945 0.0893 0.0886 0.0961 0.0975 0.1217 0.1210 0.1584 0.1782 0.1081 0.1122 0.1406 0.1416 0.1594 0.1606 0.1603
va: 2.1152 1.9934 2.2624 3.5565 3.7559 3.9037 3.9081 3.9288 3.8640 4.1589 3.7204 3.9248 3.9446 3.8561 3.6530 3.9461 3.9329 3.6364 3.8152 3.5993 3.9150 3.8704 3.8650 3.8596 3.8422 1.0205 1.0352 1.0017 1.0052 1.0039 1.0083 1.0191 0.9994 1.0080 0.9958 0.9961 1.0080 1.0091 0.9973 0.9975 1.0074 0.9991 1.0197 0.9933 1.0121 1.0129 1.0097 1.0033 0.9902 0.9906 0.9902
dispcorr: -0.028465992 hartree
energy: -1079.764903812136
dipole: 11.97879 -12.39967 -0.42088 21.50873 -20.89549 0.61325 -9.80634 8.64254 -1.16380
magnitude: 1.38118 au
magnitude: 3.51067 debye
