program: Orca
programVersion: 5.0.2
elementType: O O O C C C C C C C C C C C C C C C C C C C C C C H H H H H H H H H H H H H H H H H H H H H H H H H H
charge: 0
multiplicity: 1
keywords: wb97x-d3
keywords: def2-TZVPP
keywords: def2/J RIJCOSX
keywords: DEFGRID2
keywords: scfconv7
keywords: smallprint printgap noloewdin
keywords: NOSOSCF
formula: C22H26O3
InChI: InChI=1/C22H26O3/c1-15(2)10-19-20(22(19,3)4)21(23)25-14-17-12-18(24-13-17)11-16-8-6-5-7-9-16/h5-10,12-13,19-20H,11,14H2,1-4H3
51 atoms
O  1.278784 -0.859207 0.181498
O  2.943498 -0.385241 1.587921
O  -2.70383 -1.479354 -0.598545
C  4.664276 -0.36859 -1.035828
C  4.297463 1.042703 -0.693709
C  3.211551 -0.018409 -0.766727
C  4.996302 -0.727677 -2.464306
C  5.467555 -1.160704 -0.033375
C  4.291002 2.135412 -1.68645
C  2.507217 -0.427925 0.461583
C  4.81403 3.356149 -1.530066
C  4.6979 4.382969 -2.616815
C  5.526935 3.829996 -0.299689
C  0.447628 -1.270681 1.263975
C  -0.922968 -1.468689 0.723763
C  -2.043439 -1.987396 1.448707
C  -1.386265 -1.178445 -0.513296
C  -3.095852 -1.968739 0.596679
C  -4.533379 -2.310866 0.760227
C  -5.38862 -1.071738 0.887428
C  -5.734226 -0.581103 2.143217
C  -5.809978 -0.376328 -0.243246
C  -6.485391 0.579513 2.269597
C  -6.557357 0.786831 -0.119748
C  -6.897729 1.268813 1.137254
H  4.55893 1.328972 0.319526
H  2.582653 0.010481 -1.650004
H  6.031897 -0.467354 -2.693102
H  4.360134 -0.223874 -3.191174
H  4.884492 -1.80221 -2.62227
H  6.529606 -1.07375 -0.271794
H  5.210761 -2.221559 -0.070387
H  5.337142 -0.817942 0.990439
H  3.796184 1.919185 -2.629024
H  4.142579 4.012557 -3.478728
H  4.192971 5.282651 -2.25405
H  5.684338 4.702925 -2.963394
H  4.934209 4.581473 0.228604
H  5.759608 3.038631 0.409267
H  6.46721 4.316674 -0.565565
H  0.43981 -0.513071 2.052584
H  0.831884 -2.195058 1.704844
H  -2.058271 -2.322752 2.474193
H  -0.928239 -0.777896 -1.403251
H  -4.635138 -2.927011 1.654334
H  -4.87191 -2.917541 -0.08413
H  -5.41343 -1.112092 3.032163
H  -5.556989 -0.747279 -1.229677
H  -6.749006 0.945191 3.254106
H  -6.877239 1.316489 -1.008296
H  -7.483657 2.174045 1.233504
elementType: O C H
totalener: -1079.75427951 hartree
nucrepener: 1994.31361940 hartree
electener: -3074.06789891 hartree
oneelecener: -5427.54483689 hartree
twoeener: 2353.47693797 hartree
cpcmener: -0.02561551 hartree
kineticenergy: 1074.85183575 hartree
xcener: -106.460822895854 hartree
chargesum: -0.0000000
charge: -0.278045 -0.476043 -0.280973 0.105341 0.044955 -0.088587 -0.267381 -0.276425 -0.278328 0.391611 -0.039487 -0.219677 -0.257808 0.105941 -0.018547 -0.355399 -0.071024 0.213080 -0.072406 0.063969 -0.202904 -0.201576 -0.147552 -0.153905 -0.176600 0.089834 0.089069 0.096559 0.087429 0.097123 0.094281 0.097736 0.092482 0.115431 0.087767 0.092793 0.093145 0.099907 0.091460 0.092808 0.106460 0.111918 0.159663 0.170817 0.105307 0.116568 0.139918 0.138749 0.156488 0.156643 0.157416
qa: -0.2780 -0.4760 -0.2810 0.1053 0.0450 -0.0886 -0.2674 -0.2764 -0.2783 0.3916 -0.0395 -0.2197 -0.2578 0.1059 -0.0185 -0.3554 -0.0710 0.2131 -0.0724 0.0640 -0.2029 -0.2016 -0.1476 -0.1539 -0.1766 0.0898 0.0891 0.0966 0.0874 0.0971 0.0943 0.0977 0.0925 0.1154 0.0878 0.0928 0.0931 0.0999 0.0915 0.0928 0.1065 0.1119 0.1597 0.1708 0.1053 0.1166 0.1399 0.1387 0.1565 0.1566 0.1574
va: 2.1354 2.0325 2.2686 3.6846 3.7669 3.8643 3.9118 3.9026 3.8881 4.1543 3.7495 3.9235 3.9433 3.8541 3.7058 4.0186 3.9533 3.6363 3.8300 3.5796 3.9481 3.9615 3.8900 3.8990 3.9067 1.0322 1.0314 1.0021 1.0061 1.0019 1.0001 0.9995 1.0203 1.0119 1.0091 0.9953 0.9966 0.9956 1.0083 0.9982 0.9955 0.9900 1.0070 1.0006 1.0110 1.0067 1.0041 1.0115 0.9908 0.9909 0.9906
dispcorr: -0.020910703 hartree
energy: -1079.775190216703
dipole: 28.65434 -28.79006 -0.13572 12.65978 -12.71629 -0.05651 -8.64767 8.11881 -0.52886
magnitude: 0.54892 au
magnitude: 1.39524 debye
