program: Gaussian 09
title: 000067827
version: EM64L-G09RevD.01
frameworkgroup: C1[X(C5H2F6O4)]
method: RPBEPBE
basis: SDD
operation: Freq
keyword: #pfreq=noraman
keyword: PBEPBE/SDD
title: #p freq=noraman PBEPBE/SDD
converged: YES YES NO NO
title: Mulliken charges:
elementType: F F F F F F O O O O C C C C C H H
charge: -0.127230 -0.128012 -0.137330 -0.148720 -0.149352 -0.136592 -0.374639 -0.373875 -0.158619 -0.158943 0.274901 0.247663 0.247336 0.153091 0.152180 0.408996 0.409145
chargesum: 0.00000
title: Mulliken charges with hydrogens summed into heavy atoms:
elementType: F F F F F F O O O O C C C C C
charge: -0.127230 -0.128012 -0.137330 -0.148720 -0.149352 -0.136592 0.034357 0.035271 -0.158619 -0.158943 0.274901 0.247663 0.247336 0.153091 0.152180
polarizability: 6.86081827e+01 -2.13769113e-01 7.52553232e+01 -1.20002363e+01 -1.56846046e-01 6.06204103e+01
1716.lowfreq: -6.9875 -0.0010 -0.0007 -0.0007 5.5200 12.3450 28.4025 30.4733 52.6885
frequency: 28.2361 30.3743 52.6877 76.4637 105.0163 144.9299 166.8267 231.7979 232.6437 236.8166 250.0306 276.8459 286.9940 331.8220 335.3713 346.4601 375.3035 442.2283 464.6232 501.6357 540.1942 552.3190 583.2348 589.1281 627.5771 653.6664 705.3439 709.9789 864.9346 967.0808 1000.7139 1017.7229 1018.5496 1042.7838 1058.8100 1095.5134 1105.1116 1144.8759 1146.3110 1313.7031 1314.1225 1682.4405 1689.8366 3527.6097 3528.3035
redmass: 10.4986 10.7256 13.3546 16.4797 12.0854 9.9832 11.7164 11.5354 10.7403 17.1734 15.8400 16.9404 17.2956 14.0081 13.3237 14.9723 9.4682 10.7420 6.9037 5.5136 3.5967 7.4640 2.0154 1.6518 3.3793 4.8279 7.2494 7.9687 11.7251 13.0840 8.6881 5.6567 5.6773 13.2299 9.3460 3.2403 3.4213 11.2605 11.6093 2.5597 2.5535 11.6011 11.6072 1.0648 1.0648
irintensity: 4.7697 3.1662 0.1686 0.4527 0.8264 2.5743 0.0578 1.7780 2.4122 4.6658 0.0114 1.2317 0.2120 0.5132 0.2490 2.8229 10.6572 1.9243 0.7982 3.9875 51.3889 3.1333 180.4361 0.7096 250.7070 0.5419 60.3676 0.1854 128.3841 19.8886 112.0515 156.2470 362.3694 140.1758 40.5162 34.5593 31.5190 29.1897 46.3233 19.5466 21.5882 65.4282 344.8742 98.0221 35.3913
temp: 298.150 k
press: 1.00000 atm
elementType: 9 9 9 9 9 9 8 8 8 8 6 6 6 6 6 1 1
symmnumber: 1
zpe: 205739.6 jmol-1
zpe.correction: 0.078362 hartree
zpe.thermalcorrener: 0.093264 hartree
zpe.thermalcorrenthalpy: 0.094208 hartree
zpe.thermalcorrgfe: 0.034961 hartree
zpe.sumelectzpe: -1090.498636 hartree
zpe.sumelectthermal: -1090.483734 hartree
zpe.sumelectthermalent: -1090.482790 hartree
zpe.sumelectthermalfe: -1090.542038 hartree
dipole: 0.0429 0.5371 0.0472
dipole: 0.5409
quadrupole: -64.9952 -95.7488 -79.7771
quadrupole: 0.3025 -12.6723 0.0104
quadrupole: 15.1785 -15.5751 0.3966 0.3025 -12.6723 0.0104
hfenergy: -1090.5769984 hartree
pointgroup: C01 [X(C5H2F6O4)]
dipole: -0.0184975 -0.2115691 0.0132237 debye
dipolederiv: -0.3953676 -0.0964012 -0.125373 -0.1637122 -0.4429097 -0.2264544 -0.1095033 -0.1420786 -0.4590339 -0.3944637 0.1008232 -0.1215252 0.1661708 -0.4567158 0.2261328 -0.1037767 0.1440046 -0.4486223 -0.5043117 -0.1579632 0.1111115 -0.152015 -0.4342627 0.0995264 0.1759598 0.1819036 -0.3510373 -0.4676971 -0.1114132 -0.0709244 -0.123216 -0.3460093 -0.1185121 -0.1602205 -0.1727218 -0.4577974 -0.4676695 0.1169579 -0.064731 0.1318341 -0.3621117 0.123334 -0.1528131 0.1783718 -0.4451521 -0.4981316 0.1533981 0.117244 0.1453064 -0.4263446 -0.1045467 0.1811795 -0.1883112 -0.3641159 -0.7090449 -0.2804231 -0.3189323 -0.2049111 -0.4104305 -0.2232504 -0.3285903 -0.3056127 -0.6980239 -0.7267649 0.3039799 -0.3036943 0.22648 -0.4364403 0.2307138 -0.3210343 0.3120817 -0.6542236 -0.4109452 0.1043885 -0.1113517 -0.0616543 -0.8131228 -0.2014662 -0.1561457 0.0284262 -0.3923124 -0.4181925 -0.0939472 -0.1190129 0.0794943 -0.8196532 0.1744106 -0.1517319 -0.0523844 -0.3780906 0.8207076 -0.0055139 0.3316869 0.0018013 0.8960955 0.0000954 0.0442846 0.0006045 0.8419975 0.9240057 0.3407386 -0.0929343 0.3086087 0.6752991 0.0939726 -0.029825 -0.0443775 0.8293915 0.9134557 -0.3393076 -0.107921 -0.3093309 0.686357 -0.097618 -0.0439992 0.0376382 0.8308158 0.7579791 0.0948258 0.4698372 0.0874075 1.1560824 0.3354766 0.6145038 0.1750191 0.7315957 0.7843674 -0.1320022 0.4668481 -0.1354192 1.1770197 -0.3021108 0.6135467 -0.1421814 0.6801383 0.3960153 0.0587234 -0.0285667 0.0847098 0.1754235 0.0637541 -0.0336518 0.0542357 0.3700886 0.3960579 -0.0568638 -0.031761 -0.0815542 0.1817237 -0.0734575 -0.0381826 -0.0646178 0.364382 unknown
polarizability: 68.6451898|-0.4652402|75.2456569|11.9797881|0.4346877|60.5930695 unknown
InChI: InChI=1S/C5H2F6O4/c6-3(7,1(12)13)5(10,11)4(8,9)2(14)15/h12,14H
charge 0 multiplicity 1
17 atoms
F  0.604128 1.810899 0.997495
F  -0.59077 1.84292 -0.940032
F  1.990563 1.059811 -1.356248
F  0.461047 -0.604169 -1.717841
F  -0.460412 -0.667696 1.689008
F  -1.971889 1.026545 1.403389
O  2.735949 -0.111127 1.039572
O  -2.767753 -0.04001 -1.011542
O  1.947579 -2.063885 0.020769
O  -1.942837 -2.040764 -0.123505
C  0.004898 0.989152 0.016493
C  1.119243 0.151417 -0.707349
C  -1.115152 0.135998 0.713459
C  1.963669 -0.833694 0.156125
C  -1.97169 -0.804867 -0.18689
H  3.293534 -0.714446 1.601776
H  -3.330905 -0.615385 -1.597078
