program: Orca
programVersion: 5.0.2
elementType: O O O C C C C C C C C C C C C C C C C C C C C C C H H H H H H H H H H H H H H H H H H H H H H H H H H
charge: 0
multiplicity: 1
keywords: wb97x-d3
keywords: def2-TZVPP
keywords: def2/J RIJCOSX
keywords: DEFGRID2
keywords: scfconv7
keywords: smallprint printgap noloewdin
keywords: NOSOSCF
formula: C22H26O3
InChI: InChI=1/C22H26O3/c1-15(2)10-19-20(22(19,3)4)21(23)25-14-17-12-18(24-13-17)11-16-8-6-5-7-9-16/h5-10,12-13,19-20H,11,14H2,1-4H3
51 atoms
O  1.242293 -1.911572 -1.295298
O  0.322119 0.080685 -1.731268
O  -1.66291 -3.372173 1.615682
C  2.676105 1.000464 0.142545
C  2.992649 1.350587 -1.280974
C  2.578931 -0.060015 -0.945784
C  3.813878 0.83827 1.119477
C  1.429161 1.569766 0.772957
C  4.383898 1.600602 -1.735025
C  1.266758 -0.582995 -1.371939
C  4.925177 2.80563 -1.933058
C  6.34061 2.953312 -2.402811
C  4.192438 4.092228 -1.708471
C  0.002386 -2.597255 -1.541337
C  -0.822169 -2.650596 -0.305436
C  -1.68694 -1.642241 0.234946
C  -0.853076 -3.672276 0.581113
C  -2.166507 -2.133042 1.402469
C  -3.06464 -1.580003 2.454335
C  -3.876728 -0.426043 1.932949
C  -3.388973 0.875552 1.996025
C  -5.11853 -0.649459 1.344713
C  -4.127428 1.9340 1.483065
C  -5.861068 0.40618 0.835371
C  -5.366126 1.701901 0.901487
H  2.224475 1.939246 -1.774352
H  3.371596 -0.800844 -0.924502
H  3.507136 0.228232 1.971529
H  4.125697 1.811436 1.505909
H  4.689259 0.366472 0.673399
H  1.676171 2.494239 1.299129
H  1.005844 0.879869 1.506669
H  0.652466 1.807844 0.049774
H  5.003002 0.725561 -1.91251
H  6.387771 3.502114 -3.347353
H  6.934871 3.525459 -1.685236
H  6.829231 1.990147 -2.550731
H  4.727819 4.717311 -0.988819
H  4.131674 4.67341 -2.63256
H  3.179488 3.954394 -1.333742
H  0.295295 -3.600141 -1.848935
H  -0.535471 -2.136241 -2.370174
H  -1.918991 -0.683314 -0.199059
H  -0.374721 -4.639674 0.598457
H  -2.468489 -1.259595 3.315053
H  -3.727058 -2.370058 2.817599
H  -2.422723 1.064564 2.449685
H  -5.509659 -1.658787 1.288317
H  -3.734946 2.941359 1.540474
H  -6.828241 0.216588 0.3872
H  -5.945076 2.526357 0.505364
elementType: O C H
totalener: -1079.75343107 hartree
nucrepener: 2093.89344094 hartree
electener: -3173.64687201 hartree
oneelecener: -5627.14565619 hartree
twoeener: 2453.49878417 hartree
cpcmener: -0.02443216 hartree
kineticenergy: 1074.86019104 hartree
xcener: -106.460304453556 hartree
chargesum: 0.0000000
charge: -0.281716 -0.473096 -0.277595 0.152823 -0.012221 -0.126499 -0.266625 -0.306399 -0.257025 0.413070 -0.036711 -0.228280 -0.250042 0.069543 -0.099299 -0.291847 -0.033214 0.182420 0.001102 0.010821 -0.200220 -0.195648 -0.148627 -0.149255 -0.168645 0.098961 0.090151 0.098516 0.094986 0.090155 0.097510 0.100279 0.095212 0.118947 0.094091 0.093315 0.088543 0.095023 0.099069 0.087385 0.116751 0.117807 0.161302 0.174290 0.105164 0.104274 0.141200 0.139132 0.156590 0.156652 0.157882
qa: -0.2817 -0.4731 -0.2776 0.1528 -0.0122 -0.1265 -0.2666 -0.3064 -0.2570 0.4131 -0.0367 -0.2283 -0.2500 0.0695 -0.0993 -0.2918 -0.0332 0.1824 0.0011 0.0108 -0.2002 -0.1956 -0.1486 -0.1493 -0.1686 0.0990 0.0902 0.0985 0.0950 0.0902 0.0975 0.1003 0.0952 0.1189 0.0941 0.0933 0.0885 0.0950 0.0991 0.0874 0.1168 0.1178 0.1613 0.1743 0.1052 0.1043 0.1412 0.1391 0.1566 0.1567 0.1579
va: 2.1232 2.0333 2.2807 3.6594 3.7888 3.8914 3.9021 3.9006 3.8652 4.1769 3.7061 3.9278 3.9412 3.8552 3.7197 3.9401 3.9671 3.6954 3.8166 3.6273 3.9173 3.9475 3.8943 3.8940 3.8993 1.0239 1.0376 1.0028 1.0026 1.0030 1.0023 0.9997 1.0184 1.0076 0.9954 0.9964 1.0080 0.9977 0.9980 1.0084 0.9969 1.0088 1.0142 0.9946 1.0019 1.0110 1.0045 1.0040 0.9909 0.9907 0.9902
dispcorr: -0.023364049 hartree
energy: -1079.776795120707
dipole: 23.48691 -22.82234 0.66457 20.70624 -20.84114 -0.13491 -1.54128 2.06875 0.52747
magnitude: 0.85911 au
magnitude: 2.18369 debye
