program: Orca
programVersion: 5.0.2
elementType: O O O C C C C C C C C C C C C C C C C C C C C C C H H H H H H H H H H H H H H H H H H H H H H H H H H
charge: 0
multiplicity: 1
keywords: wb97x-d3
keywords: def2-TZVPP
keywords: def2/J RIJCOSX
keywords: DEFGRID2
keywords: scfconv7
keywords: smallprint printgap noloewdin
keywords: NOSOSCF
formula: C22H26O3
InChI: InChI=1/C22H26O3/c1-15(2)10-19-20(22(19,3)4)21(23)25-14-17-12-18(24-13-17)11-16-8-6-5-7-9-16/h5-10,12-13,19-20H,11,14H2,1-4H3
51 atoms
O  1.305048 -1.452476 -0.192162
O  1.971525 0.227118 1.125024
O  -2.25491 0.760681 -0.462762
C  4.630516 -0.068021 -0.535341
C  3.828288 1.066066 -1.09454
C  3.167236 -0.278895 -0.891822
C  5.625082 -0.761209 -1.433743
C  5.076684 0.000138 0.903705
C  4.02194 1.568753 -2.477623
C  2.115659 -0.440023 0.129347
C  4.704228 2.669008 -2.806957
C  4.829451 3.107345 -4.234541
C  5.396238 3.546716 -1.810108
C  0.196208 -1.729999 0.657436
C  -0.943267 -0.805832 0.400193
C  -2.191035 -0.799664 1.10189
C  -1.043561 0.16005 -0.541144
C  -2.947065 0.171246 0.534826
C  -4.313796 0.690866 0.820722
C  -5.205576 -0.366725 1.415214
C  -5.650852 -1.426961 0.627202
C  -5.593798 -0.315051 2.748749
C  -6.469724 -2.409808 1.160207
C  -6.414963 -1.299707 3.287179
C  -6.854965 -2.348795 2.494577
H  3.550218 1.81496 -0.358399
H  3.003939 -0.864256 -1.790479
H  6.559648 -0.197503 -1.475757
H  5.263439 -0.87317 -2.455597
H  5.857146 -1.758201 -1.05385
H  6.071192 0.44898 0.953922
H  5.146498 -0.996781 1.344402
H  4.418858 0.599448 1.529373
H  3.568508 0.987703 -3.275914
H  4.431334 4.116252 -4.373239
H  5.877722 3.145645 -4.543097
H  4.302081 2.441942 -4.918335
H  6.457335 3.64105 -2.055959
H  4.986266 4.560156 -1.830724
H  5.327564 3.178626 -0.787536
H  0.490046 -1.70891 1.709335
H  -0.088725 -2.757024 0.424787
H  -2.477057 -1.440195 1.921815
H  -0.378341 0.52284 -1.309375
H  -4.752457 1.067771 -0.107312
H  -4.253026 1.547793 1.498591
H  -5.353127 -1.482127 -0.413827
H  -5.254508 0.502657 3.374026
H  -6.810365 -3.22459 0.533711
H  -6.711469 -1.243214 4.326963
H  -7.496498 -3.115009 2.910948
elementType: O C H
totalener: -1079.75240998 hartree
nucrepener: 2023.67936003 hartree
electener: -3103.43177001 hartree
oneelecener: -5486.45729519 hartree
twoeener: 2383.02552518 hartree
cpcmener: -0.02575865 hartree
kineticenergy: 1074.84825601 hartree
xcener: -106.460689539460 hartree
chargesum: -0.0000000
charge: -0.292769 -0.463649 -0.282479 0.143746 -0.009495 -0.118829 -0.264440 -0.297240 -0.253107 0.380871 -0.039487 -0.229332 -0.249538 0.109581 -0.045027 -0.335682 -0.054058 0.198122 -0.017804 -0.001419 -0.205177 -0.172292 -0.144351 -0.153909 -0.170221 0.100822 0.089441 0.095215 0.090628 0.098455 0.094420 0.100352 0.093702 0.119469 0.094534 0.093463 0.088763 0.094778 0.098897 0.087789 0.113017 0.123394 0.161294 0.167100 0.110037 0.098496 0.142517 0.140180 0.157118 0.156283 0.157823
qa: -0.2928 -0.4636 -0.2825 0.1437 -0.0095 -0.1188 -0.2644 -0.2972 -0.2531 0.3809 -0.0395 -0.2293 -0.2495 0.1096 -0.0450 -0.3357 -0.0541 0.1981 -0.0178 -0.0014 -0.2052 -0.1723 -0.1444 -0.1539 -0.1702 0.1008 0.0894 0.0952 0.0906 0.0985 0.0944 0.1004 0.0937 0.1195 0.0945 0.0935 0.0888 0.0948 0.0989 0.0878 0.1130 0.1234 0.1613 0.1671 0.1100 0.0985 0.1425 0.1402 0.1571 0.1563 0.1578
va: 2.1202 2.0353 2.2748 3.6844 3.7808 3.8875 3.9039 3.8993 3.8679 4.1835 3.7089 3.9280 3.9417 3.8187 3.6608 3.9816 3.9502 3.6491 3.7929 3.6451 3.9359 3.9155 3.8840 3.8973 3.8970 1.0235 1.0383 1.0027 1.0029 1.0029 1.0008 0.9996 1.0197 1.0075 0.9953 0.9963 1.0079 0.9978 0.9982 1.0083 1.0121 0.9917 1.0024 0.9987 1.0087 1.0048 1.0021 1.0039 0.9905 0.9912 0.9903
dispcorr: -0.022264271 hartree
energy: -1079.774674252861
dipole: 29.80037 -29.50468 0.29569 8.30592 -8.79825 -0.49233 -9.77672 9.22065 -0.55608
magnitude: 0.79940 au
magnitude: 2.03193 debye
