program: Orca
programVersion: 5.0.2
elementType: O O O C C C C C C C C C C C C C C C C C C C C C C H H H H H H H H H H H H H H H H H H H H H H H H H H
charge: 0
multiplicity: 1
keywords: wb97x-d3
keywords: def2-TZVPP
keywords: def2/J RIJCOSX
keywords: DEFGRID2
keywords: scfconv7
keywords: smallprint printgap noloewdin
keywords: NOSOSCF
formula: C22H26O3
InChI: InChI=1/C22H26O3/c1-15(2)10-19-20(22(19,3)4)21(23)25-14-17-12-18(24-13-17)11-16-8-6-5-7-9-16/h5-10,12-13,19-20H,11,14H2,1-4H3
51 atoms
O  1.149053 -1.026797 -1.443902
O  1.015061 1.200864 -1.287368
O  -2.402807 -2.037951 1.043993
C  3.651013 0.700229 0.399434
C  3.958604 1.333885 -0.913904
C  3.094559 0.089768 -0.88095
C  4.714876 -0.118411 1.088862
C  2.7353 1.414837 1.362774
C  5.311605 1.291784 -1.527526
C  1.662309 0.180801 -1.218503
C  5.551801 1.298691 -2.841362
C  6.948349 1.288116 -3.383064
C  4.468517 1.313068 -3.875123
C  -0.247784 -1.133076 -1.764511
C  -1.093142 -1.204355 -0.543201
C  -1.439089 -0.159829 0.377457
C  -1.709475 -2.316055 -0.07753
C  -2.231613 -0.723151 1.318899
C  -2.942178 -0.177053 2.503311
C  -4.440262 -0.182063 2.311568
C  -5.044078 0.77682 1.501375
C  -5.235565 -1.156083 2.905221
C  -6.41511 0.765253 1.292725
C  -6.60965 -1.170976 2.697638
C  -7.202818 -0.211073 1.890381
H  3.395605 2.24305 -1.111918
H  3.569514 -0.837943 -1.180449
H  4.260174 -0.841749 1.768714
H  5.371128 0.522086 1.682122
H  5.337979 -0.67447 0.388236
H  3.327116 2.026264 2.047324
H  2.1669 0.704498 1.966947
H  2.027568 2.077621 0.869158
H  6.159193 1.285652 -0.847485
H  7.69801 1.267498 -2.591925
H  7.113044 0.419094 -4.025959
H  7.136647 2.169299 -4.002208
H  4.522643 0.419935 -4.503967
H  3.466423 1.36128 -3.45178
H  4.587461 2.167258 -4.546977
H  -0.335367 -2.057767 -2.333402
H  -0.550834 -0.312006 -2.415477
H  -1.143239 0.876026 0.338923
H  -1.743446 -3.334727 -0.433044
H  -2.585346 0.841465 2.664922
H  -2.679125 -0.749432 3.397257
H  -4.434843 1.540232 1.030555
H  -4.779951 -1.907691 3.539388
H  -6.870226 1.519959 0.663702
H  -7.2164 -1.934318 3.16844
H  -8.27309 -0.221352 1.727824
elementType: O C H
totalener: -1079.75377191 hartree
nucrepener: 2053.22567297 hartree
electener: -3132.97944488 hartree
oneelecener: -5545.73554483 hartree
twoeener: 2412.75609995 hartree
cpcmener: -0.02403295 hartree
kineticenergy: 1074.85537849 hartree
xcener: -106.458920868289 hartree
chargesum: -0.0000000
charge: -0.281663 -0.481019 -0.278484 0.158499 -0.033632 -0.100581 -0.290205 -0.281236 -0.286502 0.406339 -0.014436 -0.228622 -0.240992 0.066266 -0.080194 -0.313743 -0.036350 0.203383 -0.060604 0.046571 -0.196192 -0.188851 -0.157865 -0.158365 -0.169649 0.102442 0.092924 0.097757 0.098289 0.092508 0.096424 0.098099 0.093069 0.122177 0.088976 0.093996 0.095329 0.097234 0.079648 0.099190 0.115173 0.118918 0.160989 0.174244 0.116865 0.110103 0.143148 0.139325 0.157210 0.156593 0.157495
qa: -0.2817 -0.4810 -0.2785 0.1585 -0.0336 -0.1006 -0.2902 -0.2812 -0.2865 0.4063 -0.0144 -0.2286 -0.2410 0.0663 -0.0802 -0.3137 -0.0364 0.2034 -0.0606 0.0466 -0.1962 -0.1889 -0.1579 -0.1584 -0.1696 0.1024 0.0929 0.0978 0.0983 0.0925 0.0964 0.0981 0.0931 0.1222 0.0890 0.0940 0.0953 0.0972 0.0796 0.0992 0.1152 0.1189 0.1610 0.1742 0.1169 0.1101 0.1431 0.1393 0.1572 0.1566 0.1575
va: 2.1195 2.0184 2.2812 3.6984 3.8303 3.8115 3.9073 3.8891 3.8832 4.1358 3.7077 3.9306 3.9375 3.8566 3.6734 3.9990 3.9724 3.6532 3.8172 3.5889 3.9421 3.9532 3.9059 3.8996 3.8996 1.0267 1.0315 1.0029 0.9995 1.0018 1.0024 1.0001 1.0163 1.0030 1.0066 0.9964 0.9962 0.9985 1.0173 0.9999 0.9983 1.0075 1.0187 0.9944 1.0071 1.0072 1.0031 1.0052 0.9910 0.9910 0.9905
dispcorr: -0.022797323 hartree
energy: -1079.776569230427
dipole: 28.00528 -27.42537 0.57991 7.89307 -8.47275 -0.57967 -5.70917 5.69678 -0.01240
magnitude: 0.82004 au
magnitude: 2.08439 debye
