program: Orca
programVersion: 5.0.2
elementType: O O O C C C C C C C C C C C C C C C C C C C C C C H H H H H H H H H H H H H H H H H H H H H H H H H H
charge: 0
multiplicity: 1
keywords: wb97x-d3
keywords: def2-TZVPP
keywords: def2/J RIJCOSX
keywords: DEFGRID2
keywords: scfconv7
keywords: smallprint printgap noloewdin
keywords: NOSOSCF
formula: C22H26O3
InChI: InChI=1/C22H26O3/c1-15(2)10-19-20(22(19,3)4)21(23)25-14-17-12-18(24-13-17)11-16-8-6-5-7-9-16/h5-10,12-13,19-20H,11,14H2,1-4H3
51 atoms
O  1.067898 -0.836463 -1.584942
O  1.035889 1.312721 -0.967492
O  -2.50796 -2.209995 0.674846
C  3.671053 0.428139 0.523023
C  3.997989 1.236027 -0.68597
C  3.062899 0.050987 -0.822174
C  4.695693 -0.545031 1.054485
C  2.814949 1.037444 1.605746
C  5.341287 1.205098 -1.322151
C  1.636073 0.272779 -1.1162
C  5.571936 1.32002 -2.632554
C  6.963992 1.304043 -3.186126
C  4.484572 1.468756 -3.651316
C  -0.332691 -0.810258 -1.90487
C  -1.17424 -1.107952 -0.715926
C  -1.460467 -0.276931 0.417929
C  -1.837883 -2.266542 -0.493251
C  -2.271267 -0.9970 1.227607
C  -2.963837 -0.678686 2.503622
C  -4.411955 -0.312842 2.275593
C  -5.386141 -1.299189 2.145278
C  -4.788351 1.021488 2.152661
C  -6.70802 -0.957892 1.893708
C  -6.110111 1.365788 1.904932
C  -7.07413 0.375957 1.771261
H  3.487888 2.19561 -0.733475
H  3.480286 -0.842557 -1.272683
H  5.396177 -0.041565 1.7244
H  5.275667 -1.01899 0.262266
H  4.209486 -1.338305 1.625716
H  2.202733 0.279566 2.099286
H  2.152383 1.81928 1.240577
H  3.455231 1.486549 2.368089
H  6.194066 1.109409 -0.655276
H  7.716505 1.177011 -2.407744
H  7.088368 0.49501 -3.911046
H  7.185581 2.232011 -3.720146
H  3.48881 1.533809 -3.216065
H  4.643242 2.3669 -4.254082
H  4.490784 0.627251 -4.349704
H  -0.462453 -1.585803 -2.658869
H  -0.600788 0.144122 -2.359765
H  -1.116627 0.728115 0.601471
H  -1.920638 -3.180964 -1.060672
H  -2.439928 0.154543 2.973642
H  -2.892004 -1.526704 3.18977
H  -5.112294 -2.343216 2.243524
H  -4.040215 1.799568 2.25262
H  -7.454156 -1.736121 1.793777
H  -6.386633 2.408912 1.816827
H  -8.105485 0.642524 1.578558
elementType: O C H
totalener: -1079.75346790 hartree
nucrepener: 2056.19209475 hartree
electener: -3135.94556265 hartree
oneelecener: -5551.67004633 hartree
twoeener: 2415.72448368 hartree
cpcmener: -0.02392725 hartree
kineticenergy: 1074.85839958 hartree
xcener: -106.459389690030 hartree
chargesum: -0.0000000
charge: -0.282843 -0.481662 -0.279148 0.154291 -0.025813 -0.105004 -0.289109 -0.282671 -0.290375 0.407267 -0.014463 -0.226979 -0.241469 0.069670 -0.081911 -0.311038 -0.039967 0.216142 -0.067584 0.058943 -0.202246 -0.200228 -0.152598 -0.147826 -0.176578 0.103880 0.093231 0.098535 0.092879 0.097636 0.098422 0.093150 0.096296 0.121497 0.088999 0.093569 0.095350 0.081425 0.099442 0.098263 0.114535 0.119070 0.162059 0.173883 0.106292 0.116341 0.138595 0.140045 0.156089 0.156772 0.156945
qa: -0.2828 -0.4817 -0.2791 0.1543 -0.0258 -0.1050 -0.2891 -0.2827 -0.2904 0.4073 -0.0145 -0.2270 -0.2415 0.0697 -0.0819 -0.3110 -0.0400 0.2161 -0.0676 0.0589 -0.2022 -0.2002 -0.1526 -0.1478 -0.1766 0.1039 0.0932 0.0985 0.0929 0.0976 0.0984 0.0932 0.0963 0.1215 0.0890 0.0936 0.0953 0.0814 0.0994 0.0983 0.1145 0.1191 0.1621 0.1739 0.1063 0.1163 0.1386 0.1400 0.1561 0.1568 0.1569
va: 2.1175 2.0190 2.2801 3.6942 3.8236 3.8156 3.9066 3.8906 3.8863 4.1307 3.7089 3.9305 3.9367 3.8535 3.6794 4.0011 3.9716 3.6401 3.8219 3.5865 3.9610 3.9466 3.8985 3.8909 3.9059 1.0257 1.0310 0.9997 1.0021 1.0028 0.9999 1.0173 1.0020 1.0033 1.0063 0.9966 0.9964 1.0148 0.9999 0.9984 0.9985 1.0078 1.0183 0.9944 1.0111 1.0085 1.0111 1.0042 0.9910 0.9907 0.9907
dispcorr: -0.022842009 hartree
energy: -1079.776309906467
dipole: 28.34351 -27.78346 0.56005 6.95132 -7.57949 -0.62818 -4.59208 4.44365 -0.14843
magnitude: 0.85457 au
magnitude: 2.17215 debye
