program: Orca
programVersion: 5.0.2
elementType: O O O C C C C C C C C C C C C C C C C C C C C C C H H H H H H H H H H H H H H H H H H H H H H H H H H
charge: 0
multiplicity: 1
keywords: wb97x-d3
keywords: def2-TZVPP
keywords: def2/J RIJCOSX
keywords: DEFGRID2
keywords: scfconv7
keywords: smallprint printgap noloewdin
keywords: NOSOSCF
formula: C22H26O3
InChI: InChI=1/C22H26O3/c1-15(2)10-19-20(22(19,3)4)21(23)25-14-17-12-18(24-13-17)11-16-8-6-5-7-9-16/h5-10,12-13,19-20H,11,14H2,1-4H3
51 atoms
O  1.59572 -1.973473 -0.414427
O  0.722209 -0.446117 -1.793332
O  -2.891523 -2.208288 -0.241772
C  2.170009 1.474671 0.282441
C  2.862653 1.454828 -1.038509
C  2.539634 0.140258 -0.350394
C  2.949134 1.834902 1.524514
C  0.72816 1.915653 0.344192
C  4.270463 1.880807 -1.224431
C  1.524291 -0.751142 -0.942135
C  4.979086 1.696696 -2.342088
C  6.383108 2.203946 -2.467953
C  4.448069 0.988243 -3.550296
C  0.640181 -2.950741 -0.848703
C  -0.720388 -2.650353 -0.332302
C  -1.09158 -2.40836 1.02969
C  -1.856164 -2.508805 -1.052038
C  -2.418335 -2.139606 1.024812
C  -3.36628 -1.718782 2.083656
C  -3.816754 -0.279819 1.947959
C  -5.090139 0.095502 2.366086
C  -2.965532 0.700442 1.444217
C  -5.502355 1.418989 2.290861
C  -3.375277 2.023612 1.365233
C  -4.645092 2.389355 1.79015
H  2.209403 1.66013 -1.881491
H  3.364499 -0.374356 0.129704
H  3.014343 2.918868 1.638999
H  3.964004 1.438295 1.517892
H  2.451309 1.440801 2.412505
H  0.201064 1.41289 1.157319
H  0.182439 1.73057 -0.578209
H  0.680318 2.988364 0.540377
H  4.746065 2.397834 -0.396331
H  7.080783 1.384918 -2.661873
H  6.47692 2.894057 -3.310881
H  6.715659 2.724862 -1.569928
H  3.48038 0.516937 -3.385935
H  4.345003 1.678248 -4.391869
H  5.143267 0.211296 -3.876594
H  1.017798 -3.888834 -0.442685
H  0.638017 -3.035301 -1.937277
H  -0.44765 -2.415974 1.895464
H  -2.068348 -2.591103 -2.106812
H  -2.869346 -1.855508 3.047373
H  -4.242169 -2.373151 2.097211
H  -5.768658 -0.655459 2.754391
H  -1.970416 0.434709 1.106918
H  -6.497018 1.690911 2.621029
H  -2.696545 2.768971 0.969016
H  -4.96607 3.421137 1.727331
elementType: O C H
totalener: -1079.75280254 hartree
nucrepener: 2126.03599225 hartree
electener: -3205.78879480 hartree
oneelecener: -5691.43652552 hartree
twoeener: 2485.64773073 hartree
cpcmener: -0.02573364 hartree
kineticenergy: 1074.87319668 hartree
xcener: -106.465071568329 hartree
chargesum: -0.0000000
charge: -0.285570 -0.470523 -0.278144 0.180880 -0.054726 -0.076771 -0.300419 -0.301931 -0.267711 0.387883 -0.016581 -0.229200 -0.251384 0.095860 -0.058716 -0.335463 -0.032619 0.198349 -0.039682 -0.004553 -0.172419 -0.157569 -0.161590 -0.180095 -0.155797 0.099862 0.091344 0.102551 0.089314 0.099088 0.094440 0.097615 0.101667 0.122928 0.094092 0.093655 0.087951 0.080817 0.099958 0.093421 0.118582 0.117638 0.156072 0.173358 0.103228 0.105006 0.138314 0.139672 0.155295 0.155780 0.156843
qa: -0.2856 -0.4705 -0.2781 0.1809 -0.0547 -0.0768 -0.3004 -0.3019 -0.2677 0.3879 -0.0166 -0.2292 -0.2514 0.0959 -0.0587 -0.3355 -0.0326 0.1983 -0.0397 -0.0046 -0.1724 -0.1576 -0.1616 -0.1801 -0.1558 0.0999 0.0913 0.1026 0.0893 0.0991 0.0944 0.0976 0.1017 0.1229 0.0941 0.0937 0.0880 0.0808 0.1000 0.0934 0.1186 0.1176 0.1561 0.1734 0.1032 0.1050 0.1383 0.1397 0.1553 0.1558 0.1568
va: 2.1175 2.0288 2.2770 3.7236 3.8423 3.8209 3.9131 3.8750 3.8833 4.1602 3.7103 3.9298 3.9440 3.8424 3.6160 3.9715 3.9594 3.6343 3.8383 3.7164 3.9218 3.8928 3.9023 3.9151 3.8955 1.0244 1.0327 0.9985 1.0015 1.0022 0.9982 1.0150 1.0027 1.0039 0.9963 0.9952 1.0074 1.0169 0.9977 0.9988 0.9888 1.0055 1.0118 0.9965 1.0028 1.0089 1.0025 0.9944 0.9914 0.9933 0.9911
dispcorr: -0.024363544 hartree
energy: -1079.777166086794
dipole: 22.75722 -21.96818 0.78904 15.40583 -15.72041 -0.31458 -2.63816 3.46932 0.83116
magnitude: 1.18843 au
magnitude: 3.02076 debye
