program: Orca
programVersion: 5.0.2
elementType: O O O C C C C C C C C C C C C C C C C C C C C C C H H H H H H H H H H H H H H H H H H H H H H H H H H
charge: 0
multiplicity: 1
keywords: wb97x-d3
keywords: def2-TZVPP
keywords: def2/J RIJCOSX
keywords: DEFGRID2
keywords: scfconv7
keywords: smallprint printgap noloewdin
keywords: NOSOSCF
formula: C22H26O3
InChI: InChI=1/C22H26O3/c1-15(2)10-19-20(22(19,3)4)21(23)25-14-17-12-18(24-13-17)11-16-8-6-5-7-9-16/h5-10,12-13,19-20H,11,14H2,1-4H3
51 atoms
O  1.601444 -1.906035 -0.061234
O  1.693985 0.00462 1.097269
O  -2.394198 -0.717517 -0.729223
C  4.517958 0.194479 -0.295653
C  3.538184 1.085222 -0.997105
C  3.176984 -0.361013 -0.749575
C  5.719584 -0.302646 -1.061123
C  4.799874 0.434734 1.166384
C  3.745271 1.551587 -2.389864
C  2.101596 -0.696336 0.202355
C  4.152537 2.775048 -2.738847
C  4.317887 3.156738 -4.178587
C  4.479949 3.856563 -1.755415
C  0.526443 -2.39141 0.738638
C  -0.794168 -1.875281 0.280073
C  -2.069821 -2.398518 0.666799
C  -1.058298 -0.856443 -0.569994
C  -3.003554 -1.657918 0.023388
C  -4.491083 -1.670719 0.042294
C  -5.057844 -0.685122 1.037711
C  -5.58276 -1.129624 2.247114
C  -5.040483 0.68354 0.777145
C  -6.079902 -0.22848 3.179727
C  -5.532019 1.586272 1.709422
C  -6.053496 1.133154 2.914511
H  3.033215 1.786285 -0.338717
H  3.230662 -1.02114 -1.608963
H  5.489549 -0.536744 -2.100251
H  6.124641 -1.2060 -0.600455
H  6.510037 0.451199 -1.060701
H  5.039028 -0.497859 1.68211
H  3.971826 0.905987 1.691272
H  5.664944 1.093677 1.26687
H  3.548254 0.832164 -3.179898
H  4.067906 2.337566 -4.853127
H  3.68368 4.009452 -4.435582
H  5.346107 3.464082 -4.388062
H  5.506768 4.20418 -1.897576
H  3.838322 4.72871 -1.907107
H  4.38015 3.544325 -0.71707
H  0.692465 -2.164053 1.794623
H  0.559565 -3.47645 0.635367
H  -2.258393 -3.222546 1.337626
H  -0.438573 -0.175357 -1.132143
H  -4.82103 -2.678862 0.295866
H  -4.873528 -1.45663 -0.959334
H  -5.605822 -2.191846 2.461608
H  -4.641457 1.049743 -0.161581
H  -6.490098 -0.592699 4.11326
H  -5.509806 2.647009 1.493374
H  -6.44014 1.837559 3.639897
elementType: O C H
totalener: -1079.75258777 hartree
nucrepener: 2035.64610262 hartree
electener: -3115.39869039 hartree
oneelecener: -5510.58644341 hartree
twoeener: 2395.18775302 hartree
cpcmener: -0.02681926 hartree
kineticenergy: 1074.85119540 hartree
xcener: -106.460120900519 hartree
chargesum: 0.0000000
charge: -0.286915 -0.464313 -0.280406 0.150620 -0.010372 -0.119782 -0.265752 -0.297455 -0.260216 0.378083 -0.035350 -0.227463 -0.249747 0.104903 -0.029119 -0.345950 -0.054249 0.225962 -0.072152 0.042207 -0.189776 -0.197509 -0.148540 -0.154397 -0.174559 0.099407 0.089060 0.090266 0.097961 0.095369 0.100738 0.093945 0.094717 0.119571 0.088320 0.094170 0.093197 0.095079 0.098085 0.087793 0.113955 0.122710 0.159965 0.162228 0.103410 0.116982 0.138372 0.137536 0.155757 0.156327 0.157325
qa: -0.2869 -0.4643 -0.2804 0.1506 -0.0104 -0.1198 -0.2658 -0.2975 -0.2602 0.3781 -0.0353 -0.2275 -0.2497 0.1049 -0.0291 -0.3460 -0.0542 0.2260 -0.0722 0.0422 -0.1898 -0.1975 -0.1485 -0.1544 -0.1746 0.0994 0.0891 0.0903 0.0980 0.0954 0.1007 0.0939 0.0947 0.1196 0.0883 0.0942 0.0932 0.0951 0.0981 0.0878 0.1140 0.1227 0.1600 0.1622 0.1034 0.1170 0.1384 0.1375 0.1558 0.1563 0.1573
va: 2.1261 2.0343 2.2739 3.6770 3.7719 3.8883 3.9045 3.9012 3.8728 4.2020 3.7098 3.9271 3.9425 3.8311 3.6312 4.0041 3.9523 3.6033 3.8152 3.6193 3.9385 3.9549 3.8908 3.9045 3.9042 1.0256 1.0379 1.0025 1.0030 1.0028 0.9993 1.0190 1.0008 1.0078 1.0080 0.9955 0.9964 0.9977 0.9981 1.0083 1.0097 0.9928 1.0063 0.9994 1.0110 1.0085 1.0041 1.0146 0.9911 0.9914 0.9907
dispcorr: -0.022121644 hartree
energy: -1079.774709414232
dipole: 27.79274 -27.29645 0.49628 12.90685 -13.56631 -0.65946 -8.29302 7.78541 -0.50762
magnitude: 0.96895 au
magnitude: 2.46288 debye
