program: Orca
programVersion: 5.0.2
elementType: O O O C C C C C C C C C C C C C C C C C C C C C C H H H H H H H H H H H H H H H H H H H H H H H H H H
charge: 0
multiplicity: 1
keywords: wb97x-d3
keywords: def2-TZVPP
keywords: def2/J RIJCOSX
keywords: DEFGRID2
keywords: scfconv7
keywords: smallprint printgap noloewdin
keywords: NOSOSCF
formula: C22H26O3
InChI: InChI=1/C22H26O3/c1-15(2)10-19-20(22(19,3)4)21(23)25-14-17-12-18(24-13-17)11-16-8-6-5-7-9-16/h5-10,12-13,19-20H,11,14H2,1-4H3
51 atoms
O  1.664296 -2.163624 -0.192084
O  0.9834 -1.054878 -2.013752
O  -2.177061 -3.322576 1.497914
C  1.436565 1.335734 0.010923
C  2.466044 1.35309 -1.082598
C  2.226955 0.076031 -0.311859
C  1.741763 1.987365 1.3381
C  -0.019534 1.446628 -0.373512
C  3.764887 2.042664 -0.9423
C  1.562602 -1.074768 -0.952741
C  4.29334 2.919087 -1.802539
C  5.640972 3.526158 -1.550615
C  3.63731 3.36667 -3.074123
C  0.866031 -3.313016 -0.525727
C  -0.491009 -3.164723 0.064851
C  -1.546181 -2.291518 -0.354769
C  -0.939499 -3.762341 1.194186
C  -2.539739 -2.42103 0.555869
C  -3.838641 -1.711122 0.727052
C  -3.622478 -0.254309 1.065477
C  -3.034346 0.10904 2.2763
C  -3.966379 0.74571 0.162986
C  -2.797196 1.442044 2.575561
C  -3.729938 2.083084 0.460259
C  -3.144602 2.435156 1.667013
H  2.041574 1.35144 -2.080865
H  2.970326 -0.189444 0.432467
H  1.567065 3.06416 1.284462
H  2.770417 1.834029 1.662509
H  1.089276 1.587518 2.117249
H  -0.654337 0.901527 0.329021
H  -0.229093 1.078614 -1.375587
H  -0.324094 2.494782 -0.344301
H  4.341314 1.797897 -0.054381
H  6.103552 3.144375 -0.640248
H  6.322562 3.326999 -2.382285
H  5.57313 4.6140 -1.463408
H  3.679804 4.455036 -3.163768
H  4.165232 2.966458 -3.94471
H  2.592283 3.0729 -3.157838
H  1.387358 -4.161253 -0.084656
H  0.833546 -3.461823 -1.605199
H  -1.55815 -1.638363 -1.212319
H  -0.504556 -4.493912 1.857975
H  -4.41998 -2.200767 1.511731
H  -4.423828 -1.791597 -0.190922
H  -2.756411 -0.657254 2.991278
H  -4.423013 0.479251 -0.783189
H  -2.339139 1.707407 3.520189
H  -4.004116 2.848634 -0.254549
H  -2.957933 3.475841 1.899493
elementType: O C H
totalener: -1079.75231727 hartree
nucrepener: 2167.25595826 hartree
electener: -3247.00827553 hartree
oneelecener: -5773.91444415 hartree
twoeener: 2526.90616862 hartree
cpcmener: -0.02452973 hartree
kineticenergy: 1074.84962535 hartree
xcener: -106.459779022982 hartree
chargesum: -0.0000000
charge: -0.280821 -0.468318 -0.273779 0.161416 0.036300 -0.112854 -0.274071 -0.296665 -0.284931 0.397207 -0.035843 -0.221531 -0.258914 0.072888 -0.075611 -0.341987 -0.036932 0.237367 -0.040741 -0.009886 -0.165004 -0.162984 -0.161844 -0.158594 -0.171647 0.090531 0.088751 0.097220 0.089774 0.095216 0.062011 0.101311 0.102878 0.115614 0.087674 0.092436 0.093526 0.092177 0.100132 0.091584 0.115101 0.118726 0.161114 0.175192 0.110055 0.103582 0.137993 0.138487 0.155654 0.155163 0.155879
qa: -0.2808 -0.4683 -0.2738 0.1614 0.0363 -0.1129 -0.2741 -0.2967 -0.2849 0.3972 -0.0358 -0.2215 -0.2589 0.0729 -0.0756 -0.3420 -0.0369 0.2374 -0.0407 -0.0099 -0.1650 -0.1630 -0.1618 -0.1586 -0.1716 0.0905 0.0888 0.0972 0.0898 0.0952 0.0620 0.1013 0.1029 0.1156 0.0877 0.0924 0.0935 0.0922 0.1001 0.0916 0.1151 0.1187 0.1611 0.1752 0.1101 0.1036 0.1380 0.1385 0.1557 0.1552 0.1559
va: 2.1191 2.0374 2.2818 3.6394 3.7812 3.8603 3.9057 3.9130 3.8850 4.1999 3.7435 3.9245 3.9439 3.8474 3.7039 3.9498 3.9561 3.6128 3.7983 3.6800 3.8869 3.8919 3.8709 3.8769 3.8592 1.0329 1.0378 1.0020 1.0067 1.0027 1.0067 1.0199 1.0010 1.0111 1.0090 0.9952 0.9966 0.9982 0.9955 1.0078 0.9973 1.0102 1.0169 0.9939 1.0138 1.0079 1.0103 1.0035 0.9921 0.9920 0.9918
dispcorr: -0.026025039 hartree
energy: -1079.778342310960
dipole: 15.80212 -15.68436 0.11776 23.65632 -23.39712 0.25919 -4.61183 5.32014 0.70830
magnitude: 0.76338 au
magnitude: 1.94035 debye
