program: Orca
programVersion: 5.0.2
elementType: O O O C C C C C C C C C C C C C C C C C C C C C C H H H H H H H H H H H H H H H H H H H H H H H H H H
charge: 0
multiplicity: 1
keywords: wb97x-d3
keywords: def2-TZVPP
keywords: def2/J RIJCOSX
keywords: DEFGRID2
keywords: scfconv7
keywords: smallprint printgap noloewdin
keywords: NOSOSCF
formula: C22H26O3
InChI: InChI=1/C22H26O3/c1-15(2)10-19-20(22(19,3)4)21(23)25-14-17-12-18(24-13-17)11-16-8-6-5-7-9-16/h5-10,12-13,19-20H,11,14H2,1-4H3
51 atoms
O  1.776886 -1.971048 -0.304613
O  2.085575 -0.605148 1.438681
O  -2.563473 -1.341134 -0.924162
C  4.737611 0.201333 -0.002483
C  3.661027 1.13111 -0.438641
C  3.431402 -0.372367 -0.527141
C  5.928277 -0.008719 -0.90776
C  5.094039 0.123023 1.461891
C  3.745092 1.941862 -1.680045
C  2.389521 -0.968865 0.32554
C  2.700945 2.269394 -2.446017
C  2.867118 3.109749 -3.674428
C  1.299855 1.821521 -2.162619
C  0.63901 -2.581661 0.324541
C  -0.609426 -1.839345 0.003304
C  -1.03102 -0.546559 0.460923
C  -1.583674 -2.262658 -0.835612
C  -2.219677 -0.295506 -0.136145
C  -3.17936 0.836017 -0.036453
C  -4.296485 0.548077 0.939058
C  -5.393128 -0.223336 0.562081
C  -4.229509 1.023843 2.245138
C  -6.399364 -0.514212 1.472873
C  -5.236597 0.738169 3.15702
C  -6.324783 -0.033747 2.773767
H  3.11608 1.596457 0.379762
H  3.487432 -0.794671 -1.523862
H  6.408427 -0.965507 -0.693186
H  6.673648 0.774351 -0.752821
H  5.659669 -0.006798 -1.964422
H  5.432618 -0.879057 1.732969
H  4.271204 0.390525 2.119996
H  5.915085 0.811963 1.671531
H  4.7289 2.307039 -1.962264
H  3.909022 3.374087 -3.855316
H  2.492517 2.58845 -4.559568
H  2.292746 4.036783 -3.597125
H  0.609076 2.66807 -2.188955
H  0.955701 1.121423 -2.929309
H  1.187532 1.333289 -1.195951
H  0.796403 -2.666796 1.400376
H  0.593678 -3.589579 -0.086062
H  -0.521294 0.10796 1.14932
H  -1.704313 -3.162568 -1.419194
H  -3.590385 1.061075 -1.024062
H  -2.627037 1.72017 0.284458
H  -5.465206 -0.597427 -0.452619
H  -3.382634 1.626831 2.552128
H  -7.245814 -1.114963 1.164586
H  -5.171108 1.121271 4.167659
H  -7.111455 -0.256883 3.483147
elementType: O C H
totalener: -1079.75240421 hartree
nucrepener: 2096.79061625 hartree
electener: -3176.54302046 hartree
oneelecener: -5632.79952848 hartree
twoeener: 2456.25650802 hartree
cpcmener: -0.02381932 hartree
kineticenergy: 1074.85946730 hartree
xcener: -106.459572302770 hartree
chargesum: 0.0000000
charge: -0.285578 -0.481526 -0.278901 0.165038 -0.024963 -0.106307 -0.289187 -0.282038 -0.293968 0.400106 -0.009466 -0.228836 -0.227130 0.075842 -0.066760 -0.348698 -0.042061 0.236008 -0.061807 0.052789 -0.203252 -0.196406 -0.154902 -0.149801 -0.174416 0.103625 0.090100 0.097375 0.098319 0.092264 0.098231 0.093007 0.092350 0.121251 0.088905 0.094115 0.095807 0.100178 0.102053 0.067439 0.116696 0.116084 0.162389 0.174061 0.116317 0.106513 0.139189 0.139907 0.156309 0.156463 0.157272
qa: -0.2856 -0.4815 -0.2789 0.1650 -0.0250 -0.1063 -0.2892 -0.2820 -0.2940 0.4001 -0.0095 -0.2288 -0.2271 0.0758 -0.0668 -0.3487 -0.0421 0.2360 -0.0618 0.0528 -0.2033 -0.1964 -0.1549 -0.1498 -0.1744 0.1036 0.0901 0.0974 0.0983 0.0923 0.0982 0.0930 0.0924 0.1213 0.0889 0.0941 0.0958 0.1002 0.1021 0.0674 0.1167 0.1161 0.1624 0.1741 0.1163 0.1065 0.1392 0.1399 0.1563 0.1565 0.1573
va: 2.1112 2.0161 2.2798 3.6844 3.8283 3.8202 3.9138 3.8863 3.8912 4.1353 3.7211 3.9310 3.9383 3.8491 3.6697 3.9856 3.9740 3.6129 3.8091 3.6038 3.9624 3.9441 3.9020 3.8923 3.9040 1.0251 1.0337 1.0031 0.9996 1.0017 0.9991 1.0208 1.0009 1.0036 1.0062 0.9961 0.9963 1.0014 0.9979 1.0138 1.0104 0.9978 1.0208 0.9946 1.0096 1.0108 1.0116 1.0043 0.9912 0.9909 0.9906
dispcorr: -0.023707824 hartree
energy: -1079.776112034522
dipole: 20.78366 -20.65923 0.12443 11.82287 -11.79480 0.02807 -8.01014 7.07197 -0.93817
magnitude: 0.94680 au
magnitude: 2.40658 debye
