program: Orca
programVersion: 5.0.2
elementType: O O O C C C C C C C C C C C C C C C C C C C C C C H H H H H H H H H H H H H H H H H H H H H H H H H H
charge: 0
multiplicity: 1
keywords: wb97x-d3
keywords: def2-TZVPP
keywords: def2/J RIJCOSX
keywords: DEFGRID2
keywords: scfconv7
keywords: smallprint printgap noloewdin
keywords: NOSOSCF
formula: C22H26O3
InChI: InChI=1/C22H26O3/c1-15(2)10-19-20(22(19,3)4)21(23)25-14-17-12-18(24-13-17)11-16-8-6-5-7-9-16/h5-10,12-13,19-20H,11,14H2,1-4H3
51 atoms
O  1.669938 -2.110625 -0.310397
O  0.814524 -0.787571 -1.895485
O  -2.794006 -2.376057 -0.001511
C  2.121106 1.398393 0.006261
C  2.88749 1.255998 -1.276012
C  2.556607 0.020804 -0.463758
C  2.817992 1.924334 1.237831
C  0.67036 1.807975 -0.063802
C  4.294876 1.674146 -1.421256
C  1.587702 -0.963675 -0.984143
C  4.790095 2.343835 -2.466435
C  6.240049 2.714936 -2.530943
C  3.94801 2.76684 -3.6423
C  0.728489 -3.145392 -0.626296
C  -0.623619 -2.817111 -0.105589
C  -0.973993 -2.509941 1.249238
C  -1.770723 -2.71174 -0.813259
C  -2.301749 -2.247171 1.253348
C  -3.239901 -1.794912 2.309629
C  -3.729898 -0.380793 2.087909
C  -2.837297 0.63292 1.74691
C  -5.075575 -0.062942 2.236582
C  -3.279324 1.933158 1.556024
C  -5.521762 1.239985 2.050481
C  -4.625716 2.241529 1.706485
H  2.277703 1.372843 -2.166114
H  3.369364 -0.412109 0.109651
H  2.861272 3.015481 1.21712
H  3.837411 1.555089 1.343765
H  2.271549 1.633702 2.137432
H  0.105686 1.38352 0.769335
H  0.179963 1.50852 -0.987692
H  0.591588 2.894639 0.009513
H  4.971348 1.403099 -0.61615
H  6.715664 2.287449 -3.418115
H  6.366125 3.798451 -2.608105
H  6.793748 2.37349 -1.656001
H  3.107778 3.396022 -3.342734
H  4.534544 3.336608 -4.363043
H  3.530661 1.91074 -4.176829
H  1.132791 -4.032379 -0.138999
H  0.703204 -3.337333 -1.700588
H  -0.3166 -2.477417 2.104418
H  -1.999175 -2.844989 -1.859509
H  -2.718594 -1.861951 3.267698
H  -4.095954 -2.471719 2.378132
H  -1.784887 0.403776 1.624021
H  -5.784146 -0.84061 2.497347
H  -2.57081 2.706724 1.286475
H  -6.573211 1.469523 2.169074
H  -4.972795 3.255781 1.555617
elementType: O C H
totalener: -1079.75296736 hartree
nucrepener: 2116.17551967 hartree
electener: -3195.92848703 hartree
oneelecener: -5671.68010747 hartree
twoeener: 2475.75162044 hartree
cpcmener: -0.02671043 hartree
kineticenergy: 1074.86261930 hartree
xcener: -106.462215166365 hartree
chargesum: -0.0000000
charge: -0.283553 -0.466165 -0.277332 0.117788 0.047592 -0.108597 -0.274229 -0.294180 -0.301479 0.393137 -0.010851 -0.222959 -0.284700 0.096585 -0.055459 -0.347867 -0.032508 0.205583 -0.048160 -0.004003 -0.171890 -0.162007 -0.177589 -0.161544 -0.156962 0.090357 0.089414 0.097387 0.088561 0.097373 0.094190 0.096230 0.100592 0.115705 0.096980 0.096127 0.084314 0.104341 0.094560 0.102402 0.119093 0.116786 0.157076 0.173271 0.108364 0.103352 0.149761 0.138720 0.153851 0.155580 0.156962
qa: -0.2836 -0.4662 -0.2773 0.1178 0.0476 -0.1086 -0.2742 -0.2942 -0.3015 0.3931 -0.0109 -0.2230 -0.2847 0.0966 -0.0555 -0.3479 -0.0325 0.2056 -0.0482 -0.0040 -0.1719 -0.1620 -0.1776 -0.1615 -0.1570 0.0904 0.0894 0.0974 0.0886 0.0974 0.0942 0.0962 0.1006 0.1157 0.0970 0.0961 0.0843 0.1043 0.0946 0.1024 0.1191 0.1168 0.1571 0.1733 0.1084 0.1034 0.1498 0.1387 0.1539 0.1556 0.1570
va: 2.1170 2.0412 2.2764 3.6952 3.7733 3.8504 3.9093 3.9093 3.8987 4.1945 3.6950 3.9207 3.9401 3.8370 3.6059 3.9780 3.9655 3.6179 3.8356 3.7218 3.9012 3.9117 3.9161 3.9052 3.9022 1.0308 1.0353 1.0016 1.0063 1.0016 0.9972 1.0177 1.0016 1.0105 0.9926 0.9929 1.0104 0.9955 1.0047 0.9970 0.9893 1.0072 1.0115 0.9971 1.0035 1.0103 0.9901 1.0030 0.9946 0.9914 0.9908
dispcorr: -0.023819118 hartree
energy: -1079.776786474896
dipole: 21.01332 -20.38438 0.62895 19.94279 -19.98879 -0.04600 -4.07500 5.00894 0.93394
magnitude: 1.12691 au
magnitude: 2.86439 debye
