program: Orca
programVersion: 5.0.2
elementType: O O O C C C C C C C C C C C C C C C C C C C C C C H H H H H H H H H H H H H H H H H H H H H H H H H H
charge: 0
multiplicity: 1
keywords: wb97x-d3
keywords: def2-TZVPP
keywords: def2/J RIJCOSX
keywords: DEFGRID2
keywords: scfconv7
keywords: smallprint printgap noloewdin
keywords: NOSOSCF
formula: C22H26O3
InChI: InChI=1/C22H26O3/c1-15(2)10-19-20(22(19,3)4)21(23)25-14-17-12-18(24-13-17)11-16-8-6-5-7-9-16/h5-10,12-13,19-20H,11,14H2,1-4H3
51 atoms
O  1.198415 -1.361749 -1.257038
O  2.16419 -1.856217 0.695395
O  -1.983474 -2.898329 1.296636
C  1.325738 1.529304 -0.030384
C  2.193236 1.352191 -1.231445
C  2.305881 0.364044 -0.087454
C  1.659584 2.599914 0.98054
C  -0.160148 1.294837 -0.164667
C  3.333747 2.251757 -1.544691
C  1.889623 -1.049666 -0.163839
C  4.381933 1.906253 -2.297104
C  5.478714 2.877759 -2.608516
C  4.54487 0.543146 -2.896841
C  0.571902 -2.656429 -1.307762
C  -0.642997 -2.664037 -0.452642
C  -1.874071 -1.980662 -0.712218
C  -0.774213 -3.2005 0.783165
C  -2.646536 -2.146554 0.386307
C  -3.952691 -1.559945 0.791069
C  -3.753447 -0.158106 1.32108
C  -3.168182 0.053173 2.568091
C  -4.087465 0.9454 0.542487
C  -2.919488 1.340302 3.022365
C  -3.841924 2.235298 0.996361
C  -3.253217 2.436491 2.236467
H  1.671476 0.964657 -2.102037
H  3.167663 0.486732 0.559621
H  2.732791 2.729727 1.121123
H  1.229733 2.35107 1.952988
H  1.243401 3.562984 0.676583
H  -0.413697 0.610532 -0.971097
H  -0.660951 2.241674 -0.377846
H  -0.58433 0.900968 0.761614
H  3.288392 3.264623 -1.154299
H  6.441315 2.514347 -2.238771
H  5.593635 3.009104 -3.687896
H  5.297838 3.858707 -2.168581
H  4.445559 0.585329 -3.9853
H  5.543574 0.147645 -2.695171
H  3.819121 -0.180039 -2.527299
H  1.274018 -3.440279 -1.022254
H  0.319679 -2.796265 -2.357736
H  -2.135367 -1.418826 -1.595895
H  -0.120674 -3.801592 1.396065
H  -4.429658 -2.192358 1.543408
H  -4.617755 -1.536937 -0.073262
H  -2.902245 -0.793805 3.189991
H  -4.542819 0.795992 -0.429684
H  -2.463724 1.488261 3.993345
H  -4.109678 3.082759 0.37795
H  -3.058478 3.440561 2.591125
elementType: O C H
totalener: -1079.74944189 hartree
nucrepener: 2187.44110541 hartree
electener: -3267.19054729 hartree
oneelecener: -5814.15021963 hartree
twoeener: 2546.95967233 hartree
cpcmener: -0.02528477 hartree
kineticenergy: 1074.86112535 hartree
xcener: -106.461441831529 hartree
chargesum: -0.0000000
charge: -0.279228 -0.468506 -0.274147 0.203416 -0.011076 -0.119993 -0.303136 -0.309107 -0.304568 0.400772 -0.008861 -0.226885 -0.248365 0.066543 -0.039957 -0.411066 -0.019280 0.255317 -0.051195 0.008690 -0.176216 -0.167683 -0.162827 -0.167395 -0.163562 0.106124 0.092054 0.092762 0.097811 0.098696 0.096474 0.100917 0.090616 0.121999 0.094480 0.093891 0.088615 0.102459 0.093703 0.078982 0.117419 0.118021 0.161717 0.171185 0.111959 0.104437 0.137941 0.137234 0.156202 0.155815 0.156806
qa: -0.2792 -0.4685 -0.2741 0.2034 -0.0111 -0.1200 -0.3031 -0.3091 -0.3046 0.4008 -0.0089 -0.2269 -0.2484 0.0665 -0.0400 -0.4111 -0.0193 0.2553 -0.0512 0.0087 -0.1762 -0.1677 -0.1628 -0.1674 -0.1636 0.1061 0.0921 0.0928 0.0978 0.0987 0.0965 0.1009 0.0906 0.1220 0.0945 0.0939 0.0886 0.1025 0.0937 0.0790 0.1174 0.1180 0.1617 0.1712 0.1120 0.1044 0.1379 0.1372 0.1562 0.1558 0.1568
va: 2.0928 2.0328 2.2787 3.6760 3.8003 3.8311 3.9116 3.8964 3.8799 4.1566 3.7062 3.9295 3.9415 3.8531 3.6153 3.9676 3.9689 3.5522 3.8144 3.6429 3.9108 3.8908 3.8995 3.8786 3.8683 1.0200 1.0300 1.0022 1.0025 0.9992 1.0094 1.0005 0.9989 1.0038 0.9968 0.9953 1.0069 0.9977 0.9999 1.0181 1.0095 0.9940 1.0084 1.0021 1.0139 1.0108 1.0130 1.0044 0.9917 0.9920 0.9908
dispcorr: -0.027120824 hartree
energy: -1079.776562709400
dipole: 15.23771 -15.81476 -0.57706 18.69951 -17.92561 0.77390 -8.93305 7.80281 -1.13024
magnitude: 1.48639 au
magnitude: 3.77811 debye
