program: Gaussian 09
title: 000067813
version: EM64L-G09RevD.01
frameworkgroup: C1[X(C4HCl3F8Si)]
method: RPBEPBE
basis: SDD
operation: Freq
keyword: #p
keyword: freq=noraman
keyword: PBEPBE/SDD
title: #p freq=noraman PBEPBE/SDD
converged: YES YES NO NO
title: Mulliken charges:
elementType: Cl Cl Cl Si F F F F F F F F C C C C H
charge: -0.171106 -0.167049 -0.178758 0.852808 -0.142781 -0.117040 -0.140835 -0.148114 -0.129195 -0.138004 -0.158705 -0.152753 0.289571 -0.109944 0.282598 0.080073 0.249234
chargesum: 0.00000
title: Mulliken charges with hydrogens summed into heavy atoms:
elementType: Cl Cl Cl Si F F F F F F F F C C C C
charge: -0.171106 -0.167049 -0.178758 0.852808 -0.142781 -0.117040 -0.140835 -0.148114 -0.129195 -0.138004 -0.158705 -0.152753 0.289571 -0.109944 0.282598 0.329307
polarizability: 9.84459312e+01 -2.04655915e+00 9.63968747e+01 1.10496047e+00 1.93006984e+00 9.83813746e+01
1716.lowfreq: -3.5437 -0.4474 0.0008 0.0022 0.0026 3.3120 19.7477 29.5429 51.8615
frequency: 19.7467 29.5339 51.8613 61.2704 81.8866 94.4373 103.3471 119.1754 150.3115 155.0253 169.7127 190.7923 211.1338 226.0659 239.2346 252.1798 276.1759 290.1952 304.7608 317.9517 336.5830 389.0683 449.5991 462.9391 502.3891 515.9550 542.9476 556.2856 568.6260 610.5830 729.4768 797.2455 948.0237 960.7338 993.0189 1016.8266 1028.9705 1035.7869 1048.1597 1125.3224 1161.9793 1173.3407 1299.0918 1343.1243 3092.7822
redmass: 19.9179 21.4668 17.8521 12.7589 21.0437 28.7048 17.6878 25.8167 23.7073 24.6056 23.7211 21.5845 18.7988 17.1069 19.3009 17.0931 18.7084 20.0811 19.9727 17.1325 17.9046 15.5404 20.4467 16.1278 13.7986 17.3103 23.6616 27.9371 17.1344 17.8575 7.8938 9.8986 11.6405 12.7305 8.7573 12.7409 7.5130 10.1037 10.4734 11.4517 7.1810 11.0530 1.1822 1.3332 1.0881
irintensity: 0.1043 0.0116 0.9902 2.4794 0.4178 0.7468 1.2016 0.0344 5.2988 2.9948 4.1005 9.3384 2.3764 1.9475 1.5662 3.1217 1.8231 6.0829 4.8471 0.9141 0.3853 13.7474 83.9648 20.7601 12.5184 40.6116 80.7459 106.3592 6.5671 23.9075 74.0313 43.3760 80.8531 43.9912 27.1738 59.3511 30.7669 66.2493 292.2449 72.5948 8.7449 13.4031 3.3925 5.2503 10.1125
temp: 298.150 k
press: 1.00000 atm
elementType: 17 17 17 14 9 9 9 9 9 9 9 9 6 6 6 6 1
symmnumber: 1
zpe: 155715.8 jmol-1
zpe.correction: 0.059309 hartree
zpe.thermalcorrener: 0.077591 hartree
zpe.thermalcorrenthalpy: 0.078535 hartree
zpe.thermalcorrgfe: 0.009986 hartree
zpe.sumelectzpe: -2620.150648 hartree
zpe.sumelectthermal: -2620.132367 hartree
zpe.sumelectthermalent: -2620.131422 hartree
zpe.sumelectthermalfe: -2620.199972 hartree
dipole: -1.6038 1.0410 -0.9928
dipole: 2.1544
quadrupole: -126.2857 -120.6678 -120.9900
quadrupole: 2.7622 -2.8801 -2.5064
quadrupole: -3.6379 1.9800 1.6578 2.7622 -2.8801 -2.5064
hfenergy: -2620.2099574 hartree
pointgroup: C01 [X(C4H1Cl3F8Si1)]
dipole: 0.6362025 0.2962819 0.4752768 debye
dipolederiv: -0.3245068 -0.0008407 0.0728874 -0.0092535 -0.2557681 0.0144 0.0985664 -0.0021102 -0.6957143 -0.3424166 0.0887712 -0.0335064 0.1212148 -0.5996057 0.1501624 -0.0609416 0.1708329 -0.3305962 -0.4304549 -0.147393 -0.088053 -0.192102 -0.520177 -0.1575304 -0.1141857 -0.1600274 -0.3650537 1.4404088 0.1003009 0.1084117 0.0926987 1.6924905 -0.0205682 0.0650918 -0.0148499 1.7101422 -0.4588026 0.1254317 0.0017379 0.1163251 -0.5763904 -0.0063886 0.02651 -0.0882638 -0.2344406 -0.3237475 -0.0132407 0.0089248 -0.0011318 -0.2937339 0.0992383 -0.0505915 0.1815346 -0.5140033 -0.4379957 0.1862646 -0.0125128 0.1800178 -0.6731489 0.0626993 0.0052236 -0.020294 -0.2151242 -0.4338261 -0.0190272 0.1778227 -0.0143501 -0.233074 0.0363129 0.1683823 0.120108 -0.6630436 -0.5415107 -0.0869425 -0.1940981 -0.1319365 -0.3230995 -0.1675662 -0.1774399 -0.1034985 -0.471385 -0.3279573 -0.0143269 0.0280246 0.0085155 -0.4096986 0.2353461 0.0123508 0.1448809 -0.4932087 -0.3224038 0.0621274 -0.0034829 -0.0139705 -0.4872441 0.198167 0.0883662 0.2266782 -0.4482738 -0.7774368 -0.0507259 0.2310018 -0.0124656 -0.2980087 0.0250229 0.1354681 0.0235825 -0.2931973 0.6095212 -0.2150072 -0.0790322 0.0724136 0.8529628 -0.1012096 0.2292197 -0.0644131 0.7433358 0.6239542 -0.1715619 -0.1848024 -0.2218256 0.6007216 -0.1149367 -0.2115202 -0.0908512 0.5560976 0.9022542 0.1213159 0.2001156 0.1149563 0.674868 -0.0526393 0.0868019 -0.0911937 0.9350986 1.1074961 0.0433165 -0.2044391 -0.0645896 0.823579 -0.1797876 -0.2299464 -0.241574 0.7845532 0.0374243 -0.0084621 -0.0289997 -0.0445167 0.0253272 -0.0207222 -0.0713556 0.0094587 -0.0051867 unknown
polarizability: 98.4891224|1.6877293|97.4226517|1.5553451|-2.1912236|97.3124065 unknown
InChI: InChI=1S/C4HCl3F8Si/c5-16(6,7)4(14,15)3(12,13)2(10,11)1(8)9/h1H
charge 0 multiplicity 1
17 atoms
Cl 3.099566 0.076762 -2.133611
Cl 3.280745 -1.83536 0.850458
Cl 3.721641 1.66454 0.96651
Si 2.705456 0.043429 -0.020702
F  0.25851 -1.728099 -0.707313
F  -0.267768 0.189083 -1.831439
F  0.523358 1.763172 0.188732
F  0.539649 0.050505 1.700721
F  -2.503192 -1.074621 -1.036529
F  -1.723669 -1.423403 1.082286
F  -2.37716 1.751417 -0.580899
F  -3.704669 0.541534 0.846796
C  -0.244603 -0.405409 -0.551088
C  0.789422 0.367059 0.325451
C  -1.717899 -0.512554 -0.006865
C  -2.364304 0.815396 0.485653
H  -1.843482 1.251547 1.354339
