program: Orca
programVersion: 5.0.2
elementType: O O O C C C C C C C C C C C C C C C C C C C C C C H H H H H H H H H H H H H H H H H H H H H H H H H H
charge: 0
multiplicity: 1
keywords: wb97x-d3
keywords: def2-TZVPP
keywords: def2/J RIJCOSX
keywords: DEFGRID2
keywords: scfconv7
keywords: smallprint printgap noloewdin
keywords: NOSOSCF
formula: C22H26O3
InChI: InChI=1/C22H26O3/c1-15(2)10-19-20(22(19,3)4)21(23)25-14-17-12-18(24-13-17)11-16-8-6-5-7-9-16/h5-10,12-13,19-20H,11,14H2,1-4H3
51 atoms
O  1.532874 -1.707794 -1.188827
O  2.365918 -1.761669 0.883189
O  -1.93034 -1.346035 1.656075
C  4.762856 -0.186359 -0.399537
C  3.817054 0.771763 0.235662
C  3.283458 -0.262982 -0.743892
C  5.650598 0.299301 -1.520833
C  5.41504 -1.249547 0.449375
C  3.774074 2.215376 -0.112074
C  2.381752 -1.311474 -0.238336
C  2.676426 2.975698 -0.072577
C  2.722822 4.433491 -0.413973
C  1.324986 2.453494 0.306621
C  0.471671 -2.592222 -0.811078
C  -0.540153 -1.88101 0.014004
C  -1.156506 -0.623899 -0.2866
C  -1.045822 -2.262928 1.208169
C  -1.986292 -0.345968 0.746289
C  -2.922757 0.779375 1.008774
C  -4.302098 0.52009 0.449448
C  -5.160703 -0.393264 1.057831
C  -4.726513 1.172487 -0.703694
C  -6.414817 -0.648183 0.521768
C  -5.98272 0.921669 -1.24042
C  -6.830082 0.008069 -0.630391
H  3.574943 0.539935 1.270382
H  3.027569 0.108844 -1.72947
H  6.550412 0.773838 -1.123454
H  5.153305 1.02081 -2.169368
H  5.969744 -0.537424 -2.145355
H  5.623581 -2.147586 -0.13594
H  4.816046 -1.541199 1.3090
H  6.369513 -0.878234 0.828539
H  4.714955 2.680947 -0.392873
H  2.379693 5.044954 0.424921
H  3.726757 4.762987 -0.681714
H  2.058219 4.660594 -1.251897
H  0.932366 2.994003 1.172296
H  0.60807 2.612926 -0.50365
H  1.322996 1.392703 0.551469
H  0.855106 -3.475478 -0.296452
H  0.045809 -2.919082 -1.75975
H  -0.998898 -0.008137 -1.158616
H  -0.869964 -3.121192 1.838001
H  -2.508368 1.681204 0.555941
H  -2.979717 0.965761 2.084293
H  -4.849585 -0.908314 1.959428
H  -4.069095 1.886438 -1.186389
H  -7.071297 -1.360021 1.006192
H  -6.298143 1.441527 -2.136336
H  -7.809509 -0.189629 -1.046935
elementType: O C H
totalener: -1079.75193793 hartree
nucrepener: 2108.71891767 hartree
electener: -3188.47085560 hartree
oneelecener: -5656.64790746 hartree
twoeener: 2468.17705186 hartree
cpcmener: -0.02544437 hartree
kineticenergy: 1074.86661979 hartree
xcener: -106.461676434298 hartree
chargesum: -0.0000000
charge: -0.285906 -0.470396 -0.278400 0.155451 -0.020174 -0.091951 -0.289299 -0.279183 -0.294871 0.373322 -0.004990 -0.228038 -0.241807 0.103367 -0.051536 -0.388611 -0.042080 0.253179 -0.055999 0.028461 -0.199377 -0.186925 -0.156250 -0.151808 -0.172160 0.103559 0.090235 0.098899 0.092639 0.096952 0.097615 0.093290 0.093088 0.122620 0.095318 0.089045 0.094508 0.102124 0.096626 0.074187 0.114959 0.118039 0.160001 0.174637 0.101921 0.116547 0.138378 0.139641 0.156808 0.156569 0.157776
qa: -0.2859 -0.4704 -0.2784 0.1555 -0.0202 -0.0920 -0.2893 -0.2792 -0.2949 0.3733 -0.0050 -0.2280 -0.2418 0.1034 -0.0515 -0.3886 -0.0421 0.2532 -0.0560 0.0285 -0.1994 -0.1869 -0.1563 -0.1518 -0.1722 0.1036 0.0902 0.0989 0.0926 0.0970 0.0976 0.0933 0.0931 0.1226 0.0953 0.0890 0.0945 0.1021 0.0966 0.0742 0.1150 0.1180 0.1600 0.1746 0.1019 0.1165 0.1384 0.1396 0.1568 0.1566 0.1578
va: 2.1118 2.0322 2.2759 3.6991 3.8171 3.7960 3.9114 3.8858 3.8917 4.1634 3.7179 3.9277 3.9452 3.8391 3.6292 3.9656 3.9684 3.5719 3.7926 3.6310 3.9573 3.9313 3.9064 3.8973 3.9022 1.0260 1.0329 0.9995 1.0014 1.0033 0.9993 1.0205 1.0010 1.0031 0.9960 1.0067 0.9966 0.9994 0.9981 1.0101 1.0079 0.9878 1.0111 0.9949 1.0120 1.0107 1.0140 1.0036 0.9913 0.9913 0.9905
dispcorr: -0.024144690 hartree
energy: -1079.776082621853
dipole: 19.45274 -19.56907 -0.11633 14.73226 -14.00090 0.73136 -4.60333 3.62598 -0.97735
magnitude: 1.22623 au
magnitude: 3.11683 debye
