program: Orca
programVersion: 5.0.2
elementType: O O O C C C C C C C C C C C C C C C C C C C C C C H H H H H H H H H H H H H H H H H H H H H H H H H H
charge: 0
multiplicity: 1
keywords: wb97x-d3
keywords: def2-TZVPP
keywords: def2/J RIJCOSX
keywords: DEFGRID2
keywords: scfconv7
keywords: smallprint printgap noloewdin
keywords: NOSOSCF
formula: C22H26O3
InChI: InChI=1/C22H26O3/c1-15(2)10-19-20(22(19,3)4)21(23)25-14-17-12-18(24-13-17)11-16-8-6-5-7-9-16/h5-10,12-13,19-20H,11,14H2,1-4H3
51 atoms
O  1.481639 -1.778203 -1.053903
O  2.398369 -2.129134 0.953929
O  -1.859836 -2.887277 1.491243
C  1.677391 1.174353 0.082852
C  2.446002 0.94082 -1.18651
C  2.640734 0.001391 -0.028287
C  2.102759 2.287702 1.00698
C  0.184903 0.943491 0.075892
C  3.573885 1.812646 -1.607418
C  2.169255 -1.39816 0.017575
C  3.447099 2.906711 -2.362379
C  4.639334 3.716136 -2.77211
C  2.128202 3.415932 -2.855924
C  0.809502 -3.05024 -1.004035
C  -0.441255 -2.928899 -0.211481
C  -1.662434 -2.312911 -0.634702
C  -0.626151 -3.253509 1.089888
C  -2.485348 -2.306855 0.439435
C  -3.817999 -1.690918 0.680681
C  -3.657672 -0.246026 1.094027
C  -3.351477 0.090637 2.4100
C  -3.74272 0.768405 0.14486
C  -3.131575 1.41394 2.767568
C  -3.526977 2.092863 0.500535
C  -3.216622 2.419432 1.813477
H  1.839255 0.553128 -1.999792
H  3.554493 0.131922 0.543339
H  1.766759 2.090354 2.027175
H  1.661733 3.237002 0.693933
H  3.184341 2.419653 1.034128
H  -0.331085 1.88761 -0.110716
H  -0.164896 0.565411 1.039462
H  -0.136651 0.245314 -0.694515
H  4.568589 1.523977 -1.278715
H  4.552292 4.749328 -2.425163
H  5.570081 3.306632 -2.379198
H  4.726671 3.763318 -3.861022
H  1.284637 2.803857 -2.540122
H  1.951526 4.433763 -2.497748
H  2.113643 3.469067 -3.947891
H  1.469964 -3.823104 -0.610365
H  0.595676 -3.288031 -2.044805
H  -1.885165 -1.910022 -1.610942
H  -0.000315 -3.738931 1.822368
H  -4.360113 -2.252491 1.444805
H  -4.404291 -1.751845 -0.237118
H  -3.281474 -0.686332 3.162546
H  -3.979864 0.520205 -0.883305
H  -2.891918 1.660141 3.794294
H  -3.601189 2.869813 -0.249973
H  -3.045139 3.451236 2.092318
elementType: O C H
totalener: -1079.75028627 hartree
nucrepener: 2186.62746527 hartree
electener: -3266.37775154 hartree
oneelecener: -5812.45257472 hartree
twoeener: 2546.07482318 hartree
cpcmener: -0.02561074 hartree
kineticenergy: 1074.86696112 hartree
xcener: -106.461665240913 hartree
chargesum: -0.0000000
charge: -0.273728 -0.468149 -0.273798 0.170932 0.011136 -0.129215 -0.280294 -0.350023 -0.271696 0.399055 -0.033791 -0.230407 -0.250103 0.069562 -0.047631 -0.400437 -0.020061 0.247661 -0.053368 0.034256 -0.192793 -0.171963 -0.154617 -0.176188 -0.161741 0.104382 0.095245 0.101575 0.095351 0.092429 0.101364 0.107313 0.099644 0.117758 0.093611 0.088878 0.094470 0.086159 0.097080 0.101451 0.118200 0.117414 0.160713 0.171603 0.111421 0.107726 0.138717 0.136503 0.155718 0.155942 0.156734
qa: -0.2737 -0.4681 -0.2738 0.1709 0.0111 -0.1292 -0.2803 -0.3500 -0.2717 0.3991 -0.0338 -0.2304 -0.2501 0.0696 -0.0476 -0.4004 -0.0201 0.2477 -0.0534 0.0343 -0.1928 -0.1720 -0.1546 -0.1762 -0.1617 0.1044 0.0952 0.1016 0.0954 0.0924 0.1014 0.1073 0.0996 0.1178 0.0936 0.0889 0.0945 0.0862 0.0971 0.1015 0.1182 0.1174 0.1607 0.1716 0.1114 0.1077 0.1387 0.1365 0.1557 0.1559 0.1567
va: 2.1154 2.0311 2.2784 3.6767 3.7767 3.8746 3.8986 3.9085 3.8471 4.2186 3.7102 3.9295 3.9370 3.8430 3.6210 3.9679 3.9659 3.5590 3.8181 3.6094 3.9400 3.8838 3.9015 3.8728 3.8701 1.0188 1.0315 1.0024 1.0009 1.0032 1.0001 0.9953 1.0071 1.0083 0.9962 1.0075 0.9955 1.0083 0.9977 0.9993 1.0104 0.9950 1.0088 1.0035 1.0140 1.0107 1.0103 1.0048 0.9912 0.9919 0.9907
dispcorr: -0.027225226 hartree
energy: -1079.777511498934
dipole: 10.33694 -11.13672 -0.79977 24.55415 -23.58006 0.97410 -9.52815 8.34660 -1.18155
magnitude: 1.72759 au
magnitude: 4.39118 debye
