program: Orca
programVersion: 5.0.2
elementType: O O O C C C C C C C C C C C C C C C C C C C C C C H H H H H H H H H H H H H H H H H H H H H H H H H H
charge: 0
multiplicity: 1
keywords: wb97x-d3
keywords: def2-TZVPP
keywords: def2/J RIJCOSX
keywords: DEFGRID2
keywords: scfconv7
keywords: smallprint printgap noloewdin
keywords: NOSOSCF
formula: C22H26O3
InChI: InChI=1/C22H26O3/c1-15(2)10-19-20(22(19,3)4)21(23)25-14-17-12-18(24-13-17)11-16-8-6-5-7-9-16/h5-10,12-13,19-20H,11,14H2,1-4H3
51 atoms
O  1.992519 -2.254443 -0.703398
O  2.053858 -1.592395 1.430385
O  -2.259149 -1.987614 -0.916783
C  3.953287 0.675563 0.335805
C  2.548027 1.160246 0.420939
C  2.845004 -0.143398 -0.303022
C  4.89161 1.337062 -0.645302
C  4.64655 0.187714 1.583833
C  2.031943 2.324522 -0.343132
C  2.284791 -1.381805 0.261698
C  0.84744 2.350745 -0.960919
C  0.379491 3.562458 -1.706567
C  -0.087839 1.175881 -0.987635
C  1.095048 -3.332829 -0.38697
C  -0.299362 -2.818464 -0.291974
C  -1.019032 -2.388755 0.871064
C  -1.108822 -2.543607 -1.342448
C  -2.201189 -1.894829 0.433356
C  -3.35329 -1.253583 1.119769
C  -3.436867 0.221614 0.805561
C  -2.80557 1.154344 1.623394
C  -4.10504 0.669767 -0.330702
C  -2.8435 2.507649 1.316684
C  -4.141045 2.022149 -0.642844
C  -3.510088 2.945751 0.180004
H  2.085921 1.010789 1.394918
H  2.813305 -0.096808 -1.385482
H  5.36046 2.216285 -0.197969
H  4.385434 1.658877 -1.555917
H  5.689968 0.651831 -0.936874
H  5.194276 1.011464 2.0464
H  5.37118 -0.59434 1.347792
H  3.959685 -0.205618 2.329874
H  2.657986 3.212605 -0.371937
H  0.149886 3.317202 -2.74722
H  -0.544718 3.954905 -1.273351
H  1.120024 4.362541 -1.704111
H  -1.127821 1.506992 -1.011015
H  0.066593 0.578885 -1.89173
H  0.03281 0.514821 -0.130578
H  1.403358 -3.848942 0.522509
H  1.199298 -4.027906 -1.218561
H  -0.693863 -2.443504 1.897905
H  -0.999576 -2.687273 -2.406848
H  -3.230795 -1.403281 2.193141
H  -4.284684 -1.750452 0.833759
H  -2.278866 0.818828 2.509462
H  -4.60818 -0.041866 -0.975011
H  -2.351627 3.220699 1.966179
H  -4.666056 2.35496 -1.529462
H  -3.54122 4.000772 -0.060939
elementType: O C H
totalener: -1079.75100934 hartree
nucrepener: 2233.56865668 hartree
electener: -3313.31966603 hartree
oneelecener: -5906.72009910 hartree
twoeener: 2593.40043307 hartree
cpcmener: -0.02332504 hartree
kineticenergy: 1074.86065130 hartree
xcener: -106.461751440466 hartree
chargesum: 0.0000000
charge: -0.287660 -0.473026 -0.271991 0.157055 -0.000175 -0.078573 -0.284324 -0.281285 -0.328122 0.353101 0.024528 -0.222580 -0.245780 0.079062 -0.069626 -0.295014 -0.046325 0.180362 -0.048354 0.080247 -0.237668 -0.198760 -0.121737 -0.128607 -0.205599 0.100874 0.089478 0.097643 0.091931 0.097562 0.092740 0.097813 0.091081 0.120467 0.098974 0.089949 0.089742 0.076174 0.115160 0.073329 0.116021 0.120901 0.154533 0.170533 0.106101 0.115471 0.138152 0.137997 0.156388 0.155597 0.156240
qa: -0.2877 -0.4730 -0.2720 0.1571 -0.0002 -0.0786 -0.2843 -0.2813 -0.3281 0.3531 0.0245 -0.2226 -0.2458 0.0791 -0.0696 -0.2950 -0.0463 0.1804 -0.0484 0.0802 -0.2377 -0.1988 -0.1217 -0.1286 -0.2056 0.1009 0.0895 0.0976 0.0919 0.0976 0.0927 0.0978 0.0911 0.1205 0.0990 0.0899 0.0897 0.0762 0.1152 0.0733 0.1160 0.1209 0.1545 0.1705 0.1061 0.1155 0.1382 0.1380 0.1564 0.1556 0.1562
va: 2.1064 2.0246 2.2656 3.7016 3.7862 3.8038 3.9054 3.8881 3.9066 4.1981 3.6977 3.9266 3.9481 3.8440 3.6323 3.9690 3.9365 3.6436 3.8098 3.5392 3.9211 3.9550 3.8140 3.8590 3.8849 1.0280 1.0342 1.0004 1.0023 1.0031 1.0011 0.9992 1.0203 1.0053 0.9956 0.9966 1.0073 1.0120 1.0014 1.0052 1.0088 0.9959 1.0177 0.9957 1.0123 1.0048 1.0058 1.0104 0.9902 0.9907 0.9925
dispcorr: -0.028865872 hartree
energy: -1079.779875214266
dipole: 12.29145 -12.49770 -0.20625 15.94824 -15.74331 0.20493 -2.69804 1.89934 -0.79870
magnitude: 0.84998 au
magnitude: 2.16047 debye
