program: Orca
programVersion: 5.0.2
elementType: O O O C C C C C C C C C C C C C C C C C C C C C C H H H H H H H H H H H H H H H H H H H H H H H H H H
charge: 0
multiplicity: 1
keywords: wb97x-d3
keywords: def2-TZVPP
keywords: def2/J RIJCOSX
keywords: DEFGRID2
keywords: scfconv7
keywords: smallprint printgap noloewdin
keywords: NOSOSCF
formula: C22H26O3
InChI: InChI=1/C22H26O3/c1-15(2)10-19-20(22(19,3)4)21(23)25-14-17-12-18(24-13-17)11-16-8-6-5-7-9-16/h5-10,12-13,19-20H,11,14H2,1-4H3
51 atoms
O  1.689257 -2.013408 -0.692443
O  2.511924 -1.320466 1.267004
O  -1.753133 -0.364885 1.545599
C  4.859251 -0.170926 -0.476927
C  3.842202 0.893256 -0.25486
C  3.399871 -0.462713 -0.784673
C  5.753861 -0.085097 -1.690493
C  5.539156 -0.798212 0.714851
C  3.716617 2.094695 -1.119085
C  2.524939 -1.293376 0.058078
C  2.553766 2.649374 -1.471915
C  2.496748 3.862599 -2.348006
C  1.224162 2.095123 -1.053377
C  0.603192 -2.679382 -0.030325
C  -0.446259 -1.69826 0.350307
C  -1.252482 -0.912517 -0.537783
C  -0.794389 -1.311667 1.59842
C  -2.024148 -0.12028 0.242238
C  -3.075475 0.886862 -0.057091
C  -4.429431 0.454277 0.450925
C  -5.266022 -0.321797 -0.346047
C  -4.845337 0.78521 1.736991
C  -6.494844 -0.75632 0.130638
C  -6.072636 0.34914 2.21797
C  -6.900971 -0.423785 1.416109
H  3.58257 1.048241 0.790432
H  3.157262 -0.493566 -1.840818
H  6.123883 -1.075246 -1.96394
H  6.622469 0.544808 -1.486692
H  5.24282 0.325871 -2.561525
H  4.936865 -0.762721 1.619584
H  6.471276 -0.268486 0.923022
H  5.793878 -1.841859 0.5192
H  4.639436 2.55167 -1.466588
H  2.009519 4.695656 -1.834517
H  3.487061 4.192743 -2.662055
H  1.905559 3.668025 -3.247217
H  0.531878 2.898257 -0.791266
H  0.760276 1.542502 -1.875702
H  1.288677 1.423049 -0.199472
H  0.953988 -3.245511 0.833746
H  0.230321 -3.390517 -0.766577
H  -1.254933 -0.94144 -1.616561
H  -0.457633 -1.610625 2.578999
H  -3.103697 1.027818 -1.138403
H  -2.804276 1.852032 0.380617
H  -4.95407 -0.587566 -1.349673
H  -4.207732 1.393707 2.367709
H  -7.136726 -1.354945 -0.503384
H  -6.382339 0.615407 3.220711
H  -7.859136 -0.762203 1.78924
elementType: O C H
totalener: -1079.75291965 hartree
nucrepener: 2111.20166812 hartree
electener: -3190.95458778 hartree
oneelecener: -5661.68808492 hartree
twoeener: 2470.73349714 hartree
cpcmener: -0.02490572 hartree
kineticenergy: 1074.87424293 hartree
xcener: -106.462926761146 hartree
chargesum: -0.0000000
charge: -0.285736 -0.472951 -0.280189 0.156968 -0.014076 -0.081235 -0.284292 -0.282379 -0.311184 0.356718 0.010354 -0.227956 -0.259301 0.093946 -0.057517 -0.394098 -0.019099 0.227339 -0.049732 0.069264 -0.205632 -0.198233 -0.152614 -0.158870 -0.170447 0.103490 0.089541 0.097013 0.097815 0.092187 0.092253 0.092867 0.098178 0.120558 0.096003 0.088462 0.094419 0.102370 0.104544 0.086303 0.115140 0.120064 0.156721 0.172587 0.108955 0.114862 0.139707 0.138673 0.155482 0.155741 0.157020
qa: -0.2857 -0.4730 -0.2802 0.1570 -0.0141 -0.0812 -0.2843 -0.2824 -0.3112 0.3567 0.0104 -0.2280 -0.2593 0.0939 -0.0575 -0.3941 -0.0191 0.2273 -0.0497 0.0693 -0.2056 -0.1982 -0.1526 -0.1589 -0.1704 0.1035 0.0895 0.0970 0.0978 0.0922 0.0923 0.0929 0.0982 0.1206 0.0960 0.0885 0.0944 0.1024 0.1045 0.0863 0.1151 0.1201 0.1567 0.1726 0.1090 0.1149 0.1397 0.1387 0.1555 0.1557 0.1570
va: 2.1043 2.0264 2.2784 3.6963 3.8096 3.7917 3.9084 3.8878 3.9061 4.1910 3.7067 3.9330 3.9466 3.8392 3.6038 3.9815 3.9652 3.5928 3.8029 3.5691 3.9469 3.9568 3.8954 3.9016 3.9000 1.0258 1.0335 1.0031 1.0001 1.0018 1.0204 1.0010 0.9991 1.0044 0.9962 1.0065 0.9955 1.0007 0.9954 1.0018 1.0107 0.9906 1.0118 0.9987 1.0095 1.0042 1.0045 1.0087 0.9914 0.9914 0.9906
dispcorr: -0.024511182 hartree
energy: -1079.777430833187
dipole: 18.56297 -18.79782 -0.23485 11.48947 -11.20624 0.28324 -10.22750 8.94442 -1.28307
magnitude: 1.33478 au
magnitude: 3.39275 debye
