program: Gaussian 09
title: 000067808
version: EM64L-G09RevD.01
frameworkgroup: C1[X(C4F7N)]
method: RPBEPBE
basis: SDD
operation: Freq
keyword: #p
keyword: freq=noraman
keyword: PBEPBE/SDD
title: #p freq=noraman PBEPBE/SDD
converged: YES YES NO NO
title: Mulliken charges:
elementType: F F F F F F F N C C C C
charge: -0.128903 -0.121460 -0.128358 -0.130506 -0.118790 -0.136731 -0.118379 0.078646 0.236842 0.291867 0.391536 -0.115763
chargesum: 0.00000
title: Mulliken charges with hydrogens summed into heavy atoms:
polarizability: 4.93243970e+01 -8.43055477e+00 5.51025606e+01 2.45367159e+00 -4.21468417e+00 4.39544589e+01
1716.lowfreq: -6.7256 -5.7332 -0.0009 -0.0004 0.0009 3.3709 28.8376 59.6776 118.5873
frequency: 28.7556 59.6540 118.5864 135.7939 190.9102 203.3887 237.2270 263.1193 283.9127 309.3972 334.1903 369.4550 420.1213 452.9331 469.7952 527.5059 550.0279 599.5287 625.8984 665.1439 884.3738 981.0249 1013.6466 1041.0867 1062.9605 1082.2821 1102.8192 1159.6439 1200.9926 2224.2764
redmass: 17.5545 17.7493 15.8361 16.9180 16.5726 18.1997 17.6922 18.1796 18.1736 18.2645 17.7217 16.1110 15.7016 15.9970 17.0018 16.9560 14.7625 16.1470 15.6092 17.4343 13.7595 13.2033 13.4752 12.9128 13.2300 13.0625 12.7059 12.2419 12.3904 12.6621
irintensity: 0.0272 0.0409 1.0745 3.0716 2.9519 3.3952 7.3955 0.6171 0.9468 0.5520 1.8412 5.4850 10.5750 1.5845 3.2073 1.1381 7.7232 4.8768 25.0996 8.0921 185.5288 82.6085 109.7488 15.9619 235.7485 231.6315 221.9380 16.7265 52.9864 37.3789
temp: 298.150 k
press: 1.00000 atm
elementType: 9 9 9 9 9 9 9 7 6 6 6 6
symmnumber: 1
zpe: 111243.4 jmol-1
zpe.correction: 0.042370 hartree
zpe.thermalcorrener: 0.053845 hartree
zpe.thermalcorrenthalpy: 0.054790 hartree
zpe.thermalcorrgfe: 0.003946 hartree
zpe.sumelectzpe: -905.104049 hartree
zpe.sumelectthermal: -905.092574 hartree
zpe.sumelectthermalent: -905.091629 hartree
zpe.sumelectthermalfe: -905.142473 hartree
dipole: 0.3256 -0.3453 0.1499
dipole: 0.4978
quadrupole: -67.8662 -70.1680 -66.9927
quadrupole: 2.1873 -0.6143 0.9823
quadrupole: 0.4761 -1.8257 1.3496 2.1873 -0.6143 0.9823
hfenergy: -905.1464191 hartree
pointgroup: C01 [X(C4F7N1)]
dipole: -0.1337835 -0.1218556 -0.0748731 debye
dipolederiv: -0.3146603 -0.0245433 -0.0128398 0.0002206 -0.2676445 -0.0064404 -0.0433412 -0.0866763 -0.663795 -0.3622403 -0.1619175 -0.0645751 -0.1553091 -0.6424691 -0.1377982 -0.0129612 -0.0334134 -0.2599908 -0.4326307 0.189767 -0.0766153 0.107826 -0.5872042 0.0875247 -0.029931 0.0452727 -0.2845846 -0.3232448 -0.0152353 0.0086904 -0.0267897 -0.2977207 0.0047852 -0.1055507 0.004799 -0.6641501 -0.3467713 -0.0193812 -0.1729361 0.0265609 -0.2989519 -0.0556045 -0.1155156 -0.1225461 -0.698134 -0.4532676 -0.1130782 -0.0279675 -0.2036988 -0.6978152 -0.0132632 -0.0256443 0.018222 -0.2657228 -0.7027551 -0.0277987 0.2539462 0.0652963 -0.2748221 0.0091458 0.2101234 0.0497871 -0.4289692 -0.0592437 0.1157133 0.051673 0.1090413 0.0505879 0.0790178 0.0441419 0.0751834 -0.0901782 0.6526618 0.2359248 0.0878042 0.1430089 0.8808652 0.1366971 0.0090247 0.0853258 0.9027863 1.0612343 -0.111013 0.1521858 0.0517116 1.2165456 -0.0329857 0.1254692 0.017737 1.197257 1.5045372 0.1865426 -0.0900358 0.0569599 1.2873274 0.0669267 -0.0072815 0.0578552 1.3981846 -0.2236197 -0.2549804 -0.1093301 -0.1748278 -0.3686984 -0.1380055 -0.0485337 -0.1115463 -0.1427032 unknown
polarizability: 50.1855297|8.2820524|53.248963|3.6572487|5.1331418|44.9469237 unknown
InChI: InChI=1S/C4F7N/c5-2(6,1-12)3(7,8)4(9,10)11
charge 0 multiplicity 1
12 atoms
F  -0.271585 -0.428707 1.748536
F  -0.810376 -1.877785 0.062846
F  1.821879 -1.577303 0.075525
F  0.995082 -0.340746 -1.665197
F  -1.803056 0.13743 -1.50386
F  -0.912096 1.743694 -0.163113
F  -2.574166 0.398475 0.608708
N  2.433524 1.710865 0.666699
C  -0.360136 -0.576531 0.343453
C  1.093529 -0.400536 -0.244398
C  -1.433488 0.437177 -0.19255
C  1.820789 0.773967 0.263152
