program: Orca
programVersion: 5.0.2
elementType: O O O C C C C C C C C C C C C C C C C C C C C C C H H H H H H H H H H H H H H H H H H H H H H H H H H
charge: 0
multiplicity: 1
keywords: wb97x-d3
keywords: def2-TZVPP
keywords: def2/J RIJCOSX
keywords: DEFGRID2
keywords: scfconv7
keywords: smallprint printgap noloewdin
keywords: NOSOSCF
formula: C22H26O3
InChI: InChI=1/C22H26O3/c1-15(2)10-19-20(22(19,3)4)21(23)25-14-17-12-18(24-13-17)11-16-8-6-5-7-9-16/h5-10,12-13,19-20H,11,14H2,1-4H3
51 atoms
O  1.721638 -2.090882 -1.092036
O  1.928567 -1.806742 1.114514
O  -2.118788 -2.843712 1.003413
C  3.613758 0.709979 0.418763
C  2.18527 1.140205 0.455061
C  2.584429 -0.059528 -0.38945
C  4.587139 1.517579 -0.4068
C  4.244636 0.121631 1.656943
C  1.737477 2.410808 -0.171704
C  2.068448 -1.388077 -0.010381
C  0.760662 2.567959 -1.069454
C  0.426166 3.923508 -1.613955
C  -0.071192 1.448864 -1.615466
C  0.976096 -3.301953 -0.893154
C  -0.37758 -2.995697 -0.360106
C  -1.335761 -2.094585 -0.924902
C  -0.912713 -3.414662 0.809157
C  -2.366352 -2.028436 -0.049312
C  -3.580944 -1.171318 0.004326
C  -3.254795 0.276008 0.307184
C  -2.280978 0.616463 1.245185
C  -3.924465 1.299538 -0.355707
C  -1.982831 1.945292 1.507858
C  -3.631154 2.631942 -0.091568
C  -2.657065 2.960171 0.840076
H  1.66608 0.874432 1.374524
H  2.620143 0.114869 -1.458853
H  4.972931 2.361755 0.169028
H  4.136797 1.915976 -1.316411
H  5.441089 0.904509 -0.701997
H  3.526334 -0.34049 2.328609
H  4.7500 0.912656 2.215099
H  4.996902 -0.626847 1.399565
H  2.262962 3.301156 0.16616
H  -0.614968 4.18379 -1.403814
H  1.060437 4.706123 -1.197359
H  0.535177 3.945821 -2.701787
H  0.076704 0.50803 -1.092105
H  -1.13327 1.700666 -1.555804
H  0.145827 1.284046 -2.67542
H  1.513326 -3.992724 -0.240308
H  0.926056 -3.750231 -1.885096
H  -1.252881 -1.544592 -1.849884
H  -0.561033 -4.086808 1.576458
H  -4.269446 -1.562654 0.758548
H  -4.110804 -1.228027 -0.948381
H  -1.738438 -0.157997 1.774688
H  -4.679164 1.054768 -1.094312
H  -1.218017 2.188439 2.23476
H  -4.160937 3.413334 -0.621863
H  -2.42235 3.997193 1.043578
elementType: O C H
totalener: -1079.74905014 hartree
nucrepener: 2256.03359884 hartree
electener: -3335.78264898 hartree
oneelecener: -5951.56957825 hartree
twoeener: 2615.78692927 hartree
cpcmener: -0.02375875 hartree
kineticenergy: 1074.85557589 hartree
xcener: -106.463989687695 hartree
chargesum: -0.0000000
charge: -0.288895 -0.468993 -0.273927 0.148158 -0.003775 -0.104631 -0.281467 -0.288450 -0.293854 0.376200 -0.023327 -0.224587 -0.214292 0.090473 -0.055191 -0.375434 -0.028110 0.238089 -0.031306 0.019895 -0.198328 -0.191551 -0.142359 -0.127277 -0.201932 0.101283 0.101660 0.097680 0.090369 0.098267 0.093412 0.091767 0.097901 0.118349 0.090807 0.089543 0.097786 0.043467 0.094309 0.118859 0.115981 0.120139 0.161844 0.173251 0.103657 0.103629 0.137614 0.135838 0.155826 0.154744 0.156891
qa: -0.2889 -0.4690 -0.2739 0.1482 -0.0038 -0.1046 -0.2815 -0.2885 -0.2939 0.3762 -0.0233 -0.2246 -0.2143 0.0905 -0.0552 -0.3754 -0.0281 0.2381 -0.0313 0.0199 -0.1983 -0.1916 -0.1424 -0.1273 -0.2019 0.1013 0.1017 0.0977 0.0904 0.0983 0.0934 0.0918 0.0979 0.1183 0.0908 0.0895 0.0978 0.0435 0.0943 0.1189 0.1160 0.1201 0.1618 0.1733 0.1037 0.1036 0.1376 0.1358 0.1558 0.1547 0.1569
va: 2.1084 2.0330 2.2709 3.7207 3.7800 3.8315 3.9031 3.8866 3.8599 4.1622 3.7405 3.9250 3.9064 3.8524 3.6296 3.9492 3.9507 3.5897 3.8033 3.6596 3.8575 3.9378 3.8217 3.8577 3.8665 1.0228 1.0278 1.0013 1.0040 1.0027 1.0219 1.0008 0.9988 1.0056 0.9974 1.0070 0.9972 1.0165 0.9999 1.0039 1.0055 0.9893 1.0061 0.9954 1.0113 1.0070 1.0116 1.0045 0.9926 0.9911 0.9915
dispcorr: -0.029882760 hartree
energy: -1079.778932902341
dipole: 11.81259 -12.02866 -0.21607 18.89150 -18.38557 0.50593 -5.49124 4.29721 -1.19404
magnitude: 1.31467 au
magnitude: 3.34164 debye
