program: Orca
programVersion: 5.0.2
elementType: O O O C C C C C C C C C C C C C C C C C C C C C C H H H H H H H H H H H H H H H H H H H H H H H H H H
charge: 0
multiplicity: 1
keywords: wb97x-d3
keywords: def2-TZVPP
keywords: def2/J RIJCOSX
keywords: DEFGRID2
keywords: scfconv7
keywords: smallprint printgap noloewdin
keywords: NOSOSCF
formula: C22H26O3
InChI: InChI=1/C22H26O3/c1-15(2)10-19-20(22(19,3)4)21(23)25-14-17-12-18(24-13-17)11-16-8-6-5-7-9-16/h5-10,12-13,19-20H,11,14H2,1-4H3
51 atoms
O  1.118264 -1.086646 -0.138384
O  3.174301 -1.902688 -0.437763
O  -2.677087 -1.99278 1.734265
C  3.546038 0.848008 -1.96592
C  4.205277 0.87256 -0.630528
C  2.756669 0.436715 -0.730375
C  3.112452 2.151064 -2.593741
C  3.976103 -0.183714 -2.978661
C  4.561605 2.134419 0.06847
C  2.408521 -0.965485 -0.43801
C  4.539607 2.304346 1.393006
C  4.94569 3.601927 2.021743
C  4.110579 1.239096 2.354346
C  0.647692 -2.381772 0.271256
C  -0.794136 -2.245233 0.592465
C  -1.893633 -2.201041 -0.323579
C  -1.338013 -2.112363 1.824478
C  -3.012444 -2.048626 0.423251
C  -4.448884 -1.886744 0.073476
C  -4.850409 -0.432601 -0.012901
C  -4.953351 0.195174 -1.25037
C  -5.091868 0.312109 1.139165
C  -5.290849 1.539128 -1.338714
C  -5.426825 1.656239 1.053853
C  -5.52677 2.274603 -0.185833
H  4.88917 0.044381 -0.458066
H  2.014533 1.158324 -0.40761
H  3.937568 2.608383 -3.144254
H  2.762527 2.875613 -1.857977
H  2.298638 1.983704 -3.302017
H  3.150776 -0.451757 -3.641624
H  4.353454 -1.098127 -2.525766
H  4.775687 0.223911 -3.600913
H  4.892284 2.962602 -0.552701
H  4.135404 4.014331 2.62913
H  5.794862 3.462669 2.696182
H  5.225244 4.350751 1.280529
H  3.909152 0.280852 1.878467
H  4.876319 1.076974 3.117361
H  3.205939 1.542733 2.888786
H  1.208439 -2.720787 1.145036
H  0.802723 -3.104839 -0.532086
H  -1.848483 -2.276084 -1.399181
H  -0.910007 -2.09806 2.815187
H  -5.069092 -2.407116 0.807911
H  -4.622594 -2.373402 -0.887173
H  -4.770117 -0.373046 -2.155069
H  -5.021891 -0.161031 2.111808
H  -5.371435 2.010687 -2.310074
H  -5.613061 2.221794 1.95819
H  -5.790035 3.322519 -0.252277
elementType: O C H
totalener: -1079.75362166 hartree
nucrepener: 2046.12578065 hartree
electener: -3125.87940231 hartree
oneelecener: -5531.27745296 hartree
twoeener: 2405.39805065 hartree
cpcmener: -0.02563336 hartree
kineticenergy: 1074.86087573 hartree
xcener: -106.458044302929 hartree
chargesum: -0.0000000
charge: -0.274561 -0.482048 -0.276062 0.147740 -0.019750 -0.087573 -0.285752 -0.276652 -0.291134 0.386043 -0.011805 -0.228049 -0.244297 0.089008 -0.086012 -0.314538 -0.030078 0.211324 -0.070252 0.047680 -0.193854 -0.200534 -0.147732 -0.153537 -0.175589 0.100320 0.090573 0.098130 0.092434 0.097606 0.097905 0.091521 0.094716 0.120895 0.093723 0.095634 0.088658 0.081595 0.099523 0.100095 0.109748 0.109523 0.161742 0.174381 0.116120 0.105663 0.138720 0.138650 0.156303 0.156366 0.157473
qa: -0.2746 -0.4820 -0.2761 0.1477 -0.0198 -0.0876 -0.2858 -0.2767 -0.2911 0.3860 -0.0118 -0.2280 -0.2443 0.0890 -0.0860 -0.3145 -0.0301 0.2113 -0.0703 0.0477 -0.1939 -0.2005 -0.1477 -0.1535 -0.1756 0.1003 0.0906 0.0981 0.0924 0.0976 0.0979 0.0915 0.0947 0.1209 0.0937 0.0956 0.0887 0.0816 0.0995 0.1001 0.1097 0.1095 0.1617 0.1744 0.1161 0.1057 0.1387 0.1386 0.1563 0.1564 0.1575
va: 2.1161 2.0202 2.2785 3.7066 3.8104 3.8263 3.9094 3.8916 3.8924 4.1391 3.7069 3.9315 3.9383 3.8439 3.7384 3.9894 3.9486 3.6117 3.8166 3.6071 3.9421 3.9595 3.8913 3.9033 3.9049 1.0295 1.0311 0.9997 1.0018 1.0033 0.9994 1.0183 1.0010 1.0039 0.9965 0.9963 1.0066 1.0148 0.9998 0.9979 1.0011 0.9944 1.0073 0.9950 1.0095 1.0104 1.0044 1.0124 0.9910 0.9912 0.9906
dispcorr: -0.021863234 hartree
energy: -1079.775484891988
dipole: 21.55893 -22.27387 -0.71494 16.02937 -15.37219 0.65718 -3.45171 3.43013 -0.02157
magnitude: 0.97133 au
magnitude: 2.46893 debye
