program: Orca
programVersion: 5.0.2
elementType: O O O C C C C C C C C C C C C C C C C C C C C C C H H H H H H H H H H H H H H H H H H H H H H H H H H
charge: 0
multiplicity: 1
keywords: wb97x-d3
keywords: def2-TZVPP
keywords: def2/J RIJCOSX
keywords: DEFGRID2
keywords: scfconv7
keywords: smallprint printgap noloewdin
keywords: NOSOSCF
formula: C22H26O3
InChI: InChI=1/C22H26O3/c1-15(2)10-19-20(22(19,3)4)21(23)25-14-17-12-18(24-13-17)11-16-8-6-5-7-9-16/h5-10,12-13,19-20H,11,14H2,1-4H3
51 atoms
O  1.766287 -2.17896 0.073872
O  1.03052 -1.280233 -1.839352
O  -2.264114 -2.733929 1.634996
C  1.933395 1.345047 -0.350644
C  2.897735 0.999181 -1.443939
C  2.5277 -0.053012 -0.434326
C  2.408896 2.184666 0.81007
C  0.485725 1.5863 -0.702163
C  4.290849 1.515299 -1.486986
C  1.696009 -1.207685 -0.838098
C  4.63681 2.757102 -1.828553
C  6.07277 3.182668 -1.880808
C  3.6419 3.815623 -2.19598
C  0.905963 -3.311233 -0.094061
C  -0.484986 -3.00605 0.336321
C  -1.53867 -2.415327 -0.430653
C  -0.996339 -3.174265 1.579147
C  -2.589851 -2.27139 0.408644
C  -3.927118 -1.647052 0.243154
C  -4.001463 -0.288536 0.901801
C  -4.799856 -0.070527 2.016146
C  -3.242153 0.766735 0.404371
C  -4.844053 1.177918 2.622799
C  -3.284094 2.013444 1.005535
C  -4.087023 2.223238 2.119125
H  2.432101 0.846524 -2.415051
H  3.261919 -0.275729 0.332756
H  1.789917 2.002145 1.690236
H  2.338509 3.247377 0.568941
H  3.444834 1.980243 1.077176
H  0.164106 1.026945 -1.57755
H  0.332947 2.647961 -0.91042
H  -0.167916 1.317545 0.130477
H  5.079979 0.807947 -1.246322
H  6.25927 4.021652 -1.205451
H  6.749816 2.373836 -1.60748
H  6.345026 3.523743 -2.883108
H  3.75139 4.692128 -1.552297
H  3.807699 4.162201 -3.219522
H  2.612134 3.471315 -2.124001
H  1.343107 -4.084417 0.536835
H  0.931303 -3.661784 -1.126957
H  -1.498673 -2.127637 -1.467896
H  -0.584277 -3.582799 2.488035
H  -4.706398 -2.300111 0.644654
H  -4.122523 -1.553535 -0.827201
H  -5.392145 -0.88413 2.41755
H  -2.604929 0.606789 -0.457929
H  -5.470084 1.331103 3.492206
H  -2.687846 2.823167 0.604809
H  -4.11989 3.19617 2.591439
totalener: -1079.73167014 hartree
nucrepener: 2133.72361499 hartree
electener: -3213.45528513 hartree
oneelecener: -5705.82096364 hartree
twoeener: 2492.36567851 hartree
kineticenergy: 1074.91430959 hartree
xcener: -106.466891951392 hartree
chargesum: -0.0000000
charge: -0.259125 -0.401953 -0.248281 0.088760 -0.024481 -0.094055 -0.250026 -0.298614 -0.193283 0.370051 -0.020436 -0.210516 -0.246529 0.045539 -0.058654 -0.278823 -0.032315 0.234696 -0.134756 0.070351 -0.146357 -0.173682 -0.121898 -0.129644 -0.132423 0.108348 0.080290 0.100179 0.082697 0.083600 0.103484 0.082754 0.095127 0.088105 0.084134 0.079097 0.086007 0.088097 0.098500 0.084008 0.099843 0.112632 0.146433 0.134223 0.093649 0.112825 0.105210 0.125051 0.122713 0.125474 0.123976
qa: -0.2591 -0.4020 -0.2483 0.0888 -0.0245 -0.0941 -0.2500 -0.2986 -0.1933 0.3701 -0.0204 -0.2105 -0.2465 0.0455 -0.0587 -0.2788 -0.0323 0.2347 -0.1348 0.0704 -0.1464 -0.1737 -0.1219 -0.1296 -0.1324 0.1083 0.0803 0.1002 0.0827 0.0836 0.1035 0.0828 0.0951 0.0881 0.0841 0.0791 0.0860 0.0881 0.0985 0.0840 0.0998 0.1126 0.1464 0.1342 0.0936 0.1128 0.1052 0.1251 0.1227 0.1255 0.1240
va: 2.1340 2.1032 2.3127 3.7295 3.8144 3.8506 3.9020 3.9072 3.8654 4.2260 3.7360 3.9376 3.9349 3.9059 3.6984 3.9992 4.0011 3.5894 3.8844 3.6616 4.0005 3.9793 3.9604 3.9602 3.9711 1.0259 1.0346 1.0057 1.0016 1.0077 1.0206 1.0038 1.0010 1.0135 0.9988 1.0105 0.9981 0.9985 1.0038 1.0099 0.9967 1.0055 1.0229 1.0074 1.0146 1.0047 1.0117 1.0017 1.0007 1.0007 0.9999
dispcorr: -0.025142493 hartree
energy: -1079.756812636522
dipole: 18.07824 -17.83363 0.24460 23.91486 -23.60321 0.31165 -5.74332 6.13204 0.38872
magnitude: 0.55504 au
magnitude: 1.41079 debye
