program: Gaussian 09
title: 000004891
version: EM64L-G09RevD.01
frameworkgroup: C1[X(C19H24N2O2)]
method: RPBEPBE
basis: SDD
operation: Freq
keyword: #p
keyword: freq=noraman
keyword: PBEPBE/SDD
title: #p freq=noraman PBEPBE/SDD
converged: NO YES NO NO
title: Mulliken charges:
elementType: O O N N C C C C C C C C C C C C C C C C C C C H H H H H H H H H H H H H H H H H H H H H H H H
charge: -0.279421 -0.267044 -0.178859 -0.151540 -0.195207 -0.137329 -0.420951 -0.437309 -0.449886 0.188003 -0.390426 -0.398733 0.336951 -0.411742 -0.463644 -0.386826 -0.570324 0.174309 0.299311 -0.406875 -0.418958 -0.256069 -0.235754 0.245404 0.220753 0.242364 0.243943 0.187888 0.228716 0.237397 0.204486 0.202073 0.187586 0.187919 0.203925 0.233669 0.276505 0.248181 0.297941 0.199710 0.196435 0.228778 0.238737 0.239139 0.240935 0.232885 0.232956
chargesum: 0.00000
title: Mulliken charges with hydrogens summed into heavy atoms:
elementType: O O N N C C C C C C C C C C C C C C C C C C C
charge: -0.279421 -0.267044 -0.178859 -0.151540 0.050197 0.083424 0.065356 -0.020704 -0.008003 0.188003 -0.000767 -0.006889 0.336951 0.098432 0.082477 0.009318 -0.102809 0.174309 0.299311 -0.167736 -0.178023 -0.023184 -0.002799
polarizability: 2.46034808e+02 1.20614145e+01 2.41013352e+02 -1.97042635e+01 8.31282582e+00 1.59510077e+02
1716.lowfreq: -11.1445 -0.0003 0.0003 0.0004 3.0939 5.6292 17.9725 33.5454 47.1380
frequency: 8.8202 33.2405 45.4352 56.3176 79.5644 85.4675 108.5992 134.2066 157.7398 183.7682 201.2166 225.3440 235.2175 244.7958 272.6608 290.3017 312.0417 321.5300 332.1863 358.4162 383.8621 430.8254 437.2058 450.9225 456.7147 490.3538 493.2729 515.8543 542.5789 572.7557 587.7381 607.7514 644.9862 689.6614 705.6212 729.9369 742.4909 763.4129 764.3654 784.8356 787.5958 821.3582 855.5076 873.4002 878.9361 882.3708 895.7702 905.8101 923.7272 938.8205 953.3259 964.0735 976.9423 991.5160 994.6122 1016.9498 1036.0752 1048.8347 1050.1540 1056.8344 1059.4144 1071.9930 1076.8224 1116.2404 1117.4591 1136.3097 1169.5293 1174.9194 1177.5738 1183.1983 1198.5026 1199.8908 1201.8136 1215.5499 1227.8475 1230.5069 1251.2153 1256.4623 1263.2184 1275.4601 1288.2951 1295.9657 1305.2463 1321.4658 1324.2986 1326.2976 1336.8268 1338.6525 1340.7267 1343.2341 1345.8303 1354.1051 1357.7777 1382.0271 1387.2256 1395.5898 1442.8510 1452.8896 1460.5761 1462.0376 1465.4421 1469.2005 1472.9829 1474.2477 1477.0784 1480.9195 1491.4931 1574.6499 1593.5748 1606.8383 1616.8810 2933.2793 2959.3852 2959.5834 2962.9674 2965.0194 2969.6612 2970.4115 2977.2409 2983.5589 2985.2310 2991.7022 3022.2342 3028.7512 3032.7340 3040.4726 3049.7810 3058.8452 3060.8718 3083.8762 3092.0765 3111.4381 3122.5494 3142.4373 3164.0326
redmass: 3.7285 3.1792 4.9273 5.3945 5.7030 4.0055 3.5809 3.4374 3.0131 3.4414 3.5461 3.0435 2.2144 3.0417 3.4099 3.3007 6.5347 2.6015 3.9177 2.6876 3.7635 3.0368 3.0201 3.0537 3.5514 2.8791 2.3387 2.7046 3.5053 3.8185 4.0893 4.7349 4.8503 5.4641 4.4316 3.2787 3.1348 2.2232 1.6301 2.2284 1.6339 3.8964 2.2948 1.9495 1.5093 1.9844 1.5211 2.5171 1.9908 3.1488 1.4400 2.3497 2.3027 1.3301 2.2367 2.5375 2.4052 1.8993 1.7950 1.6282 2.4109 1.3224 2.1673 2.3866 1.8197 2.2693 2.3467 1.3894 1.1105 1.3851 1.8186 2.7215 1.5964 1.5776 1.5364 1.3486 1.9497 1.2917 1.3125 1.4121 1.5339 1.3565 1.2706 1.4711 1.6558 1.4151 1.3737 1.5086 1.4170 1.4900 1.5199 1.4666 1.6079 2.9794 3.2933 3.6637 2.3145 1.1343 1.0876 1.0867 1.0869 1.0861 1.1065 1.0860 1.0986 1.1433 2.1407 8.4490 6.9423 9.2806 6.5133 1.0821 1.0634 1.0684 1.0636 1.0676 1.0631 1.0624 1.0684 1.0823 1.0626 1.0624 1.0978 1.0944 1.1017 1.1030 1.0981 1.1012 1.0968 1.0957 1.0900 1.0885 1.0884 1.0925 1.1003
irintensity: 0.6116 0.1063 1.0793 0.4908 6.7446 0.2058 1.5144 0.3554 0.8308 1.4158 3.6369 0.5625 1.1154 8.1089 2.4652 8.7515 5.8742 0.9299 2.8958 0.9781 8.5953 10.5631 0.0537 2.1785 1.8093 6.5197 4.1550 2.7273 0.5469 3.9401 2.0017 16.1644 8.7535 1.2042 6.5089 4.2904 13.0052 23.7770 39.3804 0.3548 0.0820 1.1845 8.5001 8.4656 2.0835 1.0746 11.8484 7.3840 0.6562 0.3752 0.9520 1.4158 11.5588 0.0463 14.5419 5.2594 4.5476 6.5450 0.7272 4.6489 12.7843 0.5067 0.9763 0.0708 16.1809 12.7155 7.0816 52.6292 0.6270 44.3858 29.4527 13.3661 16.9802 11.7670 16.2857 1.7911 45.7231 0.8702 1.0485 35.0494 34.6789 30.7684 3.9178 11.3817 11.6934 0.9785 0.4492 30.3714 13.7562 2.2909 28.2878 3.6996 3.3386 199.7362 44.6906 83.1869 7.9948 17.2499 8.1170 3.0937 14.1280 16.5059 3.3588 9.9839 12.2351 11.9137 22.9852 279.7068 3.7202 307.6539 4.7604 16.0362 7.0654 45.7131 35.1631 30.9094 46.2337 37.6763 25.7628 22.8277 35.4119 21.9526 62.4323 70.6531 16.7566 66.3499 34.1866 61.2853 20.5883 4.3400 1.5630 13.0667 4.2621 20.9686 26.7967
temp: 298.150 k
press: 1.00000 atm
elementType: 8 8 7 7 6 6 6 6 6 6 6 6 6 6 6 6 6 6 6 6 6 6 6 1 1 1 1 1 1 1 1 1 1 1 1 1 1 1 1 1 1 1 1 1 1 1 1
symmnumber: 1
zpe: 1044291.6 jmol-1
zpe.correction: 0.397750 hartree
zpe.thermalcorrener: 0.417841 hartree
zpe.thermalcorrenthalpy: 0.418785 hartree
zpe.thermalcorrgfe: 0.347273 hartree
zpe.sumelectzpe: -996.696128 hartree
zpe.sumelectthermal: -996.676037 hartree
zpe.sumelectthermalent: -996.675093 hartree
zpe.sumelectthermalfe: -996.746605 hartree
dipole: -2.7020 -6.8703 0.2061
dipole: 7.3854
quadrupole: -132.1347 -157.4250 -133.0623
quadrupole: -0.8747 -1.0254 1.3165
quadrupole: 8.7393 -16.5510 7.8117 -0.8747 -1.0254 1.3165
hfenergy: -997.093878 hartree
pointgroup: C01 [X(C19H24N2O2)]
dipole: 1.2377026 -2.628297 -0.0546784 debye
polarizability: 247.1855463|-12.0265033|239.1492702|-19.8580152|-10.6568654|160.2234209 unknown
InChI: InChI=1S/C19H24N2O2/c22-18-13-20(19(23)15-7-2-1-3-8-15)12-17-16-9-5-4-6-14(16)10-11-21(17)18/h4-6,9,15,17H,1-3,7-8,10-13H2
charge 0 multiplicity 1
47 atoms
O  -3.045775 2.06735 0.635898
O  1.41737 3.938691 -0.278074
N  1.89403 1.685621 0.116464
N  -0.920267 1.205688 0.316428
C  1.404353 0.391707 0.651969
C  -2.925635 -0.243878 -0.170692
C  0.014427 0.100246 0.022002
C  -3.335302 -1.09679 1.069124
C  -4.162504 0.03704 -1.066997
C  -2.311323 1.087701 0.287956
C  -4.04997 -2.403051 0.649094
C  -4.872085 -1.271273 -1.482383
C  2.35434 -0.770161 0.365182
C  3.288707 1.817001 -0.351693
C  -0.363062 2.54212 0.64766
C  -5.27608 -2.111844 -0.248369
C  3.629688 0.656765 -1.305481
C  1.048817 2.787837 0.106503
C  3.384157 -0.67314 -0.609142
C  2.165189 -1.986056 1.067421
C  4.192648 -1.806804 -0.86977
C  2.970905 -3.1111 0.796419
C  3.987615 -3.022529 -0.183397
H  1.265187 0.475696 1.752494
H  -2.194823 -0.824552 -0.768435
H  0.154329 -0.040638 -1.069724
H  -0.372005 -0.843293 0.443206
H  -2.445456 -1.331329 1.688649
H  -4.011828 -0.485177 1.698225
H  -4.854543 0.690621 -0.504271
H  -3.849662 0.605867 -1.96383
H  -4.358348 -2.9652 1.552008
H  -3.339304 -3.051327 0.09463
H  -4.198334 -1.873496 -2.127681
H  -5.765407 -1.032303 -2.091101
H  3.982104 1.810197 0.513104
H  3.361978 2.801146 -0.843053
H  -0.3512 2.696471 1.747688
H  -1.029255 3.316493 0.236937
H  -5.748947 -3.06103 -0.566869
H  -6.033951 -1.554761 0.339884
H  4.685309 0.731677 -1.625019
H  3.00707 0.746713 -2.217644
H  1.387878 -2.04969 1.839899
H  4.995532 -1.728514 -1.61286
H  2.815699 -4.043932 1.348861
H  4.623035 -3.888777 -0.397521
