program: Orca
programVersion: 5.0.2
elementType: O O O C C C C C C C C C C C C C C C C C C C C C C H H H H H H H H H H H H H H H H H H H H H H H H H H
charge: 0
multiplicity: 1
keywords: wb97x-d3
keywords: def2-TZVPP
keywords: def2/J RIJCOSX
keywords: DEFGRID2
keywords: scfconv7
keywords: smallprint printgap noloewdin
keywords: NOSOSCF
formula: C22H26O3
InChI: InChI=1/C22H26O3/c1-15(2)10-19-20(22(19,3)4)21(23)25-14-17-12-18(24-13-17)11-16-8-6-5-7-9-16/h5-10,12-13,19-20H,11,14H2,1-4H3
51 atoms
O  1.741211 -2.463783 -0.792222
O  1.97076 -1.604724 1.260449
O  -2.535264 -2.656529 -0.567351
C  3.705368 0.562493 -0.182963
C  2.299976 1.053777 -0.008204
C  2.547479 -0.29379 -0.653682
C  4.549032 1.18212 -1.271218
C  4.501688 0.180198 1.040285
C  1.722105 2.156251 -0.810722
C  2.077262 -1.498221 0.065259
C  1.438295 3.379212 -0.357027
C  0.820785 4.414268 -1.24867
C  1.698567 3.82846 1.048497
C  0.989369 -3.570891 -0.273873
C  -0.431318 -3.172113 -0.085224
C  -1.008671 -2.476063 1.023743
C  -1.416776 -3.251258 -1.0112
C  -2.279381 -2.176008 0.669516
C  -3.31365 -1.325587 1.307699
C  -3.388918 0.056873 0.690732
C  -2.230729 0.767181 0.386722
C  -4.618935 0.652191 0.440313
C  -2.30185 2.040795 -0.154078
C  -4.694551 1.929584 -0.097504
C  -3.535504 2.628121 -0.39726
H  1.932544 0.977569 1.010462
H  2.417952 -0.340439 -1.729565
H  3.979138 1.402227 -2.173247
H  5.368621 0.517316 -1.549118
H  4.983111 2.12157 -0.924345
H  5.043949 1.05209 1.41111
H  5.240612 -0.585903 0.797188
H  3.882125 -0.198902 1.848516
H  1.503664 1.93785 -1.852135
H  1.457472 5.299108 -1.325581
H  0.646084 4.037482 -2.25569
H  -0.136959 4.758372 -0.848246
H  2.186991 3.071699 1.65839
H  2.33677 4.71539 1.052811
H  0.768167 4.113963 1.54582
H  1.432891 -3.941341 0.650903
H  1.080706 -4.348181 -1.03151
H  -0.520529 -2.208102 1.945842
H  -1.455344 -3.686273 -1.997192
H  -3.066943 -1.239191 2.369054
H  -4.294812 -1.804814 1.259062
H  -1.259597 0.318937 0.56069
H  -5.530769 0.110795 0.664121
H  -1.384917 2.566297 -0.389985
H  -5.662281 2.375246 -0.287849
H  -3.592845 3.621875 -0.82187
totalener: -1079.73077884 hartree
nucrepener: 2183.93122870 hartree
electener: -3263.66200754 hartree
oneelecener: -5806.18372979 hartree
twoeener: 2542.52172225 hartree
kineticenergy: 1074.91290758 hartree
xcener: -106.467915821313 hartree
chargesum: 0.0000000
charge: -0.262533 -0.407103 -0.244707 0.166044 -0.041808 -0.101764 -0.236899 -0.275543 -0.200485 0.350688 -0.044224 -0.216807 -0.233178 0.059646 -0.069382 -0.281016 -0.028967 0.209390 -0.088677 0.071935 -0.212607 -0.171940 -0.041022 -0.086811 -0.192323 0.097896 0.072467 0.074866 0.091528 0.088165 0.081804 0.085832 0.103210 0.086294 0.097902 0.087007 0.078149 0.083513 0.086521 0.090161 0.111235 0.100196 0.154499 0.133816 0.100026 0.088160 0.135399 0.104427 0.106751 0.122150 0.118121
qa: -0.2625 -0.4071 -0.2447 0.1660 -0.0418 -0.1018 -0.2369 -0.2755 -0.2005 0.3507 -0.0442 -0.2168 -0.2332 0.0596 -0.0694 -0.2810 -0.0290 0.2094 -0.0887 0.0719 -0.2126 -0.1719 -0.0410 -0.0868 -0.1923 0.0979 0.0725 0.0749 0.0915 0.0882 0.0818 0.0858 0.1032 0.0863 0.0979 0.0870 0.0781 0.0835 0.0865 0.0902 0.1112 0.1002 0.1545 0.1338 0.1000 0.0882 0.1354 0.1044 0.1068 0.1222 0.1181
va: 2.1311 2.0823 2.3147 3.7070 3.7771 3.9529 3.9092 3.9066 3.8496 4.2006 3.7626 3.9196 3.9471 3.8900 3.7177 3.9745 3.9997 3.6279 3.8828 3.7106 4.0457 3.9998 3.8786 3.9339 4.0194 1.0282 1.0409 1.0082 1.0051 1.0058 1.0017 1.0031 1.0221 1.0179 0.9991 1.0099 0.9970 1.0116 1.0003 1.0000 1.0083 0.9960 1.0192 1.0075 1.0014 1.0148 0.9972 1.0113 1.0020 1.0005 1.0048
dispcorr: -0.025738286 hartree
energy: -1079.756517124817
dipole: 16.16700 -16.03156 0.13544 22.86728 -22.53140 0.33588 -0.34887 -0.02513 -0.37401
magnitude: 0.52062 au
magnitude: 1.32330 debye
