program: Orca
programVersion: 5.0.2
elementType: O O O C C C C C C C C C C C C C C C C C C C C C C H H H H H H H H H H H H H H H H H H H H H H H H H H
charge: 0
multiplicity: 1
keywords: wb97x-d3
keywords: def2-TZVPP
keywords: def2/J RIJCOSX
keywords: DEFGRID2
keywords: scfconv7
keywords: smallprint printgap noloewdin
keywords: NOSOSCF
formula: C22H26O3
InChI: InChI=1/C22H26O3/c1-15(2)10-19-20(22(19,3)4)21(23)25-14-17-12-18(24-13-17)11-16-8-6-5-7-9-16/h5-10,12-13,19-20H,11,14H2,1-4H3
51 atoms
O  1.343861 -1.335791 0.922016
O  1.753785 -1.624776 -1.258482
O  -2.508562 -2.155535 -1.135015
C  2.130521 1.521055 -0.924253
C  3.408984 0.820076 -1.290898
C  2.589996 0.31234 -0.13091
C  2.184339 2.850999 -0.211162
C  0.955332 1.406709 -1.864493
C  4.737715 1.415488 -1.053038
C  1.87196 -0.97734 -0.251547
C  5.743991 1.499736 -1.926477
C  7.048175 2.130721 -1.537634
C  5.696188 0.994756 -3.336713
C  0.497044 -2.488294 0.922021
C  -0.827098 -2.201823 0.308778
C  -1.882918 -1.397551 0.847538
C  -1.270243 -2.622647 -0.897434
C  -2.875689 -1.405384 -0.072514
C  -4.221235 -0.769267 -0.130523
C  -4.517879 0.010104 1.120424
C  -5.056839 -0.623064 2.235099
C  -4.231882 1.368215 1.196642
C  -5.309511 0.085912 3.399255
C  -4.48246 2.081766 2.359373
C  -5.023365 1.441867 3.464136
H  3.326093 0.197795 -2.174893
H  2.952349 0.532997 0.867794
H  1.249419 3.034704 0.320972
H  2.32693 3.663157 -0.92618
H  2.991803 2.911564 0.517093
H  0.012099 1.48088 -1.319028
H  0.945386 0.471727 -2.419866
H  0.983443 2.222909 -2.588908
H  4.908267 1.820507 -0.059647
H  7.281102 2.982297 -2.182023
H  7.044122 2.482687 -0.506644
H  7.874908 1.423953 -1.646632
H  5.911487 1.802639 -4.03997
H  6.460287 0.231073 -3.499644
H  4.736949 0.566395 -3.615831
H  0.389442 -2.747001 1.975084
H  0.984897 -3.324319 0.417485
H  -1.894959 -0.882342 1.794313
H  -0.815655 -3.222166 -1.668854
H  -4.986238 -1.5371 -0.283282
H  -4.279123 -0.110891 -1.003123
H  -5.280162 -1.682401 2.190226
H  -3.808482 1.873203 0.336541
H  -5.73329 -0.42066 4.25647
H  -4.257067 3.139355 2.401154
H  -5.223021 1.997144 4.371071
totalener: -1079.73325078 hartree
nucrepener: 2082.02473775 hartree
electener: -3161.75798853 hartree
oneelecener: -5602.38910300 hartree
twoeener: 2440.63111447 hartree
kineticenergy: 1074.91178969 hartree
xcener: -106.467880917948 hartree
chargesum: 0.0000000
charge: -0.260654 -0.389029 -0.255557 0.086244 0.042729 -0.081656 -0.248199 -0.254678 -0.189980 0.338841 -0.049407 -0.204511 -0.236067 0.060117 -0.081024 -0.257605 0.007788 0.171123 -0.050062 0.019061 -0.158023 -0.150547 -0.122490 -0.125137 -0.126462 0.085957 0.070978 0.090556 0.091669 0.070515 0.083408 0.095840 0.086236 0.070477 0.082812 0.075453 0.084429 0.082771 0.086864 0.084009 0.104823 0.106450 0.137030 0.143246 0.095169 0.091576 0.111408 0.108106 0.124738 0.124750 0.125914
qa: -0.2607 -0.3890 -0.2556 0.0862 0.0427 -0.0817 -0.2482 -0.2547 -0.1900 0.3388 -0.0494 -0.2045 -0.2361 0.0601 -0.0810 -0.2576 0.0078 0.1711 -0.0501 0.0191 -0.1580 -0.1505 -0.1225 -0.1251 -0.1265 0.0860 0.0710 0.0906 0.0917 0.0705 0.0834 0.0958 0.0862 0.0705 0.0828 0.0755 0.0844 0.0828 0.0869 0.0840 0.1048 0.1065 0.1370 0.1432 0.0952 0.0916 0.1114 0.1081 0.1247 0.1247 0.1259
va: 2.1270 2.1163 2.3027 3.7582 3.7870 3.8518 3.9107 3.9124 3.9049 4.2679 3.8245 3.9356 3.9453 3.8914 3.6876 3.9973 3.9798 3.6864 3.8544 3.6684 3.9822 3.9808 3.9588 3.9625 3.9529 1.0385 1.0367 1.0042 1.0040 1.0108 1.0035 1.0213 1.0019 1.0210 0.9982 1.0125 0.9979 0.9994 0.9988 1.0157 0.9907 1.0088 1.0108 1.0133 1.0063 1.0078 1.0108 1.0119 1.0004 1.0004 0.9996
dispcorr: -0.022714956 hartree
energy: -1079.755965737861
dipole: 22.64360 -22.77679 -0.13319 17.46713 -16.97908 0.48805 -7.59614 8.07025 0.47411
magnitude: 0.69334 au
magnitude: 1.76232 debye
