program: Orca
programVersion: 5.0.2
elementType: O O O C C C C C C C C C C C C C C C C C C C C C C H H H H H H H H H H H H H H H H H H H H H H H H H H
charge: 0
multiplicity: 1
keywords: wb97x-d3
keywords: def2-TZVPP
keywords: def2/J RIJCOSX
keywords: DEFGRID2
keywords: scfconv7
keywords: smallprint printgap noloewdin
keywords: NOSOSCF
formula: C22H26O3
InChI: InChI=1/C22H26O3/c1-15(2)10-19-20(22(19,3)4)21(23)25-14-17-12-18(24-13-17)11-16-8-6-5-7-9-16/h5-10,12-13,19-20H,11,14H2,1-4H3
51 atoms
O  1.744093 -2.391123 -0.84237
O  2.023319 -1.569714 1.219794
O  -2.541074 -2.632812 -0.545749
C  3.843356 0.52779 -0.236889
C  2.476741 1.093747 0.005824
C  2.622896 -0.251948 -0.682379
C  4.696973 1.105382 -1.341371
C  4.654712 0.077685 0.953676
C  1.931619 2.243474 -0.739873
C  2.117913 -1.449193 0.024654
C  1.337648 3.321633 -0.221055
C  0.835983 4.422893 -1.10848
C  1.121153 3.556253 1.243157
C  0.999932 -3.505184 -0.328766
C  -0.418744 -3.114749 -0.11246
C  -0.977787 -2.417012 1.004861
C  -1.425699 -3.215752 -1.012721
C  -2.261086 -2.138028 0.68007
C  -3.291102 -1.294642 1.334344
C  -3.391447 0.081352 0.706906
C  -2.24582 0.798587 0.373688
C  -4.631491 0.660548 0.468521
C  -2.339888 2.061456 -0.187924
C  -4.729521 1.928798 -0.087123
C  -3.582958 2.633436 -0.418759
H  2.149971 1.005745 1.036017
H  2.451939 -0.264302 -1.753108
H  5.209178 2.004624 -0.99506
H  4.124238 1.375831 -2.227311
H  5.457217 0.386151 -1.650369
H  4.041453 -0.305295 1.765237
H  5.235623 0.918339 1.338314
H  5.360142 -0.705329 0.667823
H  2.024659 2.198897 -1.820862
H  -0.223023 4.62757 -0.929059
H  1.366355 5.357695 -0.909604
H  0.95648 4.187971 -2.165093
H  1.534991 2.775578 1.877108
H  1.575128 4.501781 1.549621
H  0.054466 3.636091 1.469013
H  1.458185 -3.888203 0.583702
H  1.080221 -4.271586 -1.098696
H  -0.470489 -2.135252 1.912386
H  -1.484024 -3.661043 -1.993126
H  -3.025481 -1.198582 2.390259
H  -4.268081 -1.783881 1.306566
H  -1.267149 0.363098 0.536585
H  -5.533779 0.113053 0.714991
H  -1.433266 2.589041 -0.455794
H  -5.704885 2.361477 -0.268007
H  -3.657205 3.618156 -0.861368
totalener: -1079.73152476 hartree
nucrepener: 2182.31477012 hartree
electener: -3262.04629489 hartree
oneelecener: -5802.89817344 hartree
twoeener: 2540.85187855 hartree
kineticenergy: 1074.91231938 hartree
xcener: -106.468989230018 hartree
chargesum: 0.0000000
charge: -0.261011 -0.410103 -0.245249 0.095042 0.029143 -0.074621 -0.245329 -0.258355 -0.160086 0.349586 -0.110752 -0.193077 -0.222068 0.059026 -0.068019 -0.283658 -0.029454 0.210404 -0.087306 0.070522 -0.202609 -0.172583 -0.067669 -0.088278 -0.185685 0.089507 0.071734 0.092725 0.070985 0.091068 0.101500 0.084230 0.083061 0.071952 0.072544 0.094552 0.081138 0.085613 0.088811 0.081612 0.111634 0.099894 0.155959 0.133890 0.100074 0.088230 0.130721 0.104512 0.125491 0.122444 0.118305
qa: -0.2610 -0.4101 -0.2452 0.0950 0.0291 -0.0746 -0.2453 -0.2584 -0.1601 0.3496 -0.1108 -0.1931 -0.2221 0.0590 -0.0680 -0.2837 -0.0295 0.2104 -0.0873 0.0705 -0.2026 -0.1726 -0.0677 -0.0883 -0.1857 0.0895 0.0717 0.0927 0.0710 0.0911 0.1015 0.0842 0.0831 0.0720 0.0725 0.0946 0.0811 0.0856 0.0888 0.0816 0.1116 0.0999 0.1560 0.1339 0.1001 0.0882 0.1307 0.1045 0.1255 0.1224 0.1183
va: 2.1316 2.0800 2.3146 3.7498 3.7657 3.8825 3.9177 3.9069 3.8659 4.2035 3.8687 3.9178 3.9375 3.8902 3.7171 3.9743 4.0003 3.6284 3.8824 3.7125 4.0371 4.0014 3.8840 3.9390 4.0163 1.0375 1.0389 1.0038 1.0106 1.0046 1.0228 1.0009 1.0032 1.0223 0.9995 0.9978 1.0122 1.0144 1.0013 1.0030 1.0084 0.9961 1.0189 1.0075 1.0016 1.0152 1.0041 1.0113 0.9910 1.0004 1.0049
dispcorr: -0.025479121 hartree
energy: -1079.757003884176
dipole: 15.62826 -15.52147 0.10679 21.94199 -21.66988 0.27211 -0.06629 -0.30761 -0.37390
magnitude: 0.47460 au
magnitude: 1.20634 debye
