program: Orca
programVersion: 5.0.2
elementType: O O O C C C C C C C C C C C C C C C C C C C C C C H H H H H H H H H H H H H H H H H H H H H H H H H H
charge: 0
multiplicity: 1
keywords: wb97x-d3
keywords: def2-TZVPP
keywords: def2/J RIJCOSX
keywords: DEFGRID2
keywords: scfconv7
keywords: smallprint printgap noloewdin
keywords: NOSOSCF
formula: C22H26O3
InChI: InChI=1/C22H26O3/c1-15(2)10-19-20(22(19,3)4)21(23)25-14-17-12-18(24-13-17)11-16-8-6-5-7-9-16/h5-10,12-13,19-20H,11,14H2,1-4H3
51 atoms
O  1.731547 -2.077983 -0.16019
O  0.879934 -1.030728 -1.946361
O  -2.135869 -2.873544 1.626809
C  1.632664 1.472051 -0.19842
C  2.599597 1.32592 -1.337437
C  2.323194 0.140957 -0.441327
C  2.04467 2.217028 1.049115
C  0.167728 1.647461 -0.519205
C  3.939619 1.941808 -1.328991
C  1.567928 -1.020144 -0.957883
C  4.513706 2.628477 -2.319327
C  5.895743 3.19074 -2.162901
C  3.875083 2.910461 -3.645345
C  0.895171 -3.217258 -0.388826
C  -0.464958 -2.992243 0.171369
C  -1.571319 -2.321087 -0.440152
C  -0.878235 -3.301467 1.423146
C  -2.551924 -2.27344 0.490283
C  -3.886558 -1.618626 0.513056
C  -3.831608 -0.288867 1.228555
C  -3.477293 0.864174 0.536398
C  -4.078587 -0.200554 2.59323
C  -3.373814 2.081168 1.191732
C  -3.974954 1.015434 3.253083
C  -3.622653 2.160147 2.554257
H  2.120888 1.250191 -2.307395
H  3.088971 -0.111609 0.284137
H  1.916434 3.292212 0.911709
H  3.082833 2.043828 1.329379
H  1.42248 1.91284 1.892374
H  -0.459935 1.24509 0.278405
H  -0.122537 1.164663 -1.448969
H  -0.057979 2.711959 -0.610849
H  4.516053 1.810895 -0.417664
H  5.894331 4.277469 -2.280411
H  6.325818 2.960296 -1.188938
H  6.569563 2.79694 -2.928113
H  3.817116 3.98731 -3.820559
H  4.475921 2.496699 -4.458554
H  2.869266 2.509879 -3.741783
H  1.395255 -4.036441 0.126695
H  0.854527 -3.459161 -1.451677
H  -1.60829 -1.914351 -1.436749
H  -0.39787 -3.808142 2.24491
H  -4.622964 -2.2734 0.985829
H  -4.212969 -1.474701 -0.518231
H  -3.271726 0.808345 -0.526339
H  -4.350836 -1.090997 3.146896
H  -3.097186 2.96836 0.637019
H  -4.169942 1.068563 4.316227
H  -3.54362 3.109144 3.067968
totalener: -1079.73208251 hartree
nucrepener: 2140.22024765 hartree
electener: -3219.95233016 hartree
oneelecener: -5718.85456581 hartree
twoeener: 2498.90223566 hartree
kineticenergy: 1074.91689838 hartree
xcener: -106.468330603760 hartree
chargesum: 0.0000000
charge: -0.259766 -0.401690 -0.251972 0.106037 0.046049 -0.089726 -0.249429 -0.286400 -0.186058 0.361278 -0.053116 -0.204302 -0.236779 0.046953 -0.052129 -0.290114 -0.032767 0.242475 -0.133793 0.131637 -0.223490 -0.168817 -0.120927 -0.115205 -0.134546 0.087733 0.069063 0.089753 0.070941 0.095267 0.100440 0.095700 0.085783 0.069738 0.083085 0.076324 0.084266 0.083603 0.086756 0.082694 0.097964 0.113365 0.142596 0.133533 0.104776 0.103624 0.114703 0.109254 0.127901 0.123534 0.124203
qa: -0.2598 -0.4017 -0.2520 0.1060 0.0460 -0.0897 -0.2494 -0.2864 -0.1861 0.3613 -0.0531 -0.2043 -0.2368 0.0470 -0.0521 -0.2901 -0.0328 0.2425 -0.1338 0.1316 -0.2235 -0.1688 -0.1209 -0.1152 -0.1345 0.0877 0.0691 0.0898 0.0709 0.0953 0.1004 0.0957 0.0858 0.0697 0.0831 0.0763 0.0843 0.0836 0.0868 0.0827 0.0980 0.1134 0.1426 0.1335 0.1048 0.1036 0.1147 0.1093 0.1279 0.1235 0.1242
va: 2.1319 2.1019 2.3090 3.7422 3.7861 3.8797 3.9088 3.9224 3.9030 4.2307 3.8258 3.9343 3.9456 3.9070 3.7111 4.0110 3.9967 3.5803 3.8806 3.5519 3.9834 4.0255 3.9263 3.9510 3.9645 1.0349 1.0387 1.0043 1.0109 1.0044 0.9927 1.0222 1.0022 1.0216 0.9981 1.0124 0.9981 0.9993 0.9989 1.0162 0.9968 1.0063 1.0248 1.0070 1.0125 1.0109 1.0084 1.0149 0.9980 0.9999 0.9995
dispcorr: -0.024485710 hartree
energy: -1079.756568220229
dipole: 17.36714 -17.20345 0.16369 22.28693 -22.08877 0.19816 -7.39877 7.79089 0.39211
magnitude: 0.46884 au
magnitude: 1.19170 debye
