program: Orca
programVersion: 5.0.2
elementType: O O O C C C C C C C C C C C C C C C C C C C C C C H H H H H H H H H H H H H H H H H H H H H H H H H H
charge: 0
multiplicity: 1
keywords: wb97x-d3
keywords: def2-TZVPP
keywords: def2/J RIJCOSX
keywords: DEFGRID2
keywords: scfconv7
keywords: smallprint printgap noloewdin
keywords: NOSOSCF
formula: C22H26O3
InChI: InChI=1/C22H26O3/c1-15(2)10-19-20(22(19,3)4)21(23)25-14-17-12-18(24-13-17)11-16-8-6-5-7-9-16/h5-10,12-13,19-20H,11,14H2,1-4H3
51 atoms
O  1.585427 -1.834438 -0.161988
O  1.783212 -0.013173 1.123952
O  -2.875414 -1.850773 -0.358247
C  4.491664 0.257982 -0.433205
C  3.478561 1.225218 -0.965112
C  3.113923 -0.232411 -0.849378
C  5.630553 -0.157724 -1.332535
C  4.879137 0.329714 1.023302
C  3.602825 1.854479 -2.305113
C  2.103563 -0.645669 0.149655
C  4.314741 2.952756 -2.561144
C  4.370375 3.550327 -3.934502
C  5.099885 3.681074 -1.51312
C  0.582208 -2.372819 0.706794
C  -0.780359 -1.878011 0.375298
C  -1.339739 -0.579235 0.602972
C  -1.76656 -2.595398 -0.212195
C  -2.608458 -0.622195 0.135331
C  -3.705605 0.380385 0.101802
C  -4.829894 0.04155 1.051046
C  -5.948987 -0.655171 0.611831
C  -4.747631 0.398442 2.39266
C  -6.967574 -0.986676 1.493478
C  -5.764399 0.072197 3.275944
C  -6.87906 -0.622543 2.828178
H  3.013901 1.845232 -0.202575
H  3.094987 -0.805801 -1.770172
H  6.435562 0.578949 -1.292211
H  5.328684 -0.249572 -2.374909
H  6.040624 -1.117652 -1.01403
H  5.178228 -0.651028 1.398466
H  4.07831 0.701323 1.657382
H  5.735435 0.997416 1.140445
H  3.058297 1.388966 -3.121611
H  3.786747 2.9776 -4.654199
H  3.989087 4.574531 -3.933304
H  5.399259 3.602135 -4.299179
H  4.726481 4.700605 -1.386798
H  5.066875 3.190834 -0.542016
H  6.148516 3.771137 -1.807295
H  0.83259 -2.16042 1.747264
H  0.634884 -3.451405 0.559879
H  -0.849434 0.265899 1.056227
H  -1.815814 -3.61406 -0.562629
H  -4.094637 0.474321 -0.916125
H  -3.277441 1.350747 0.358925
H  -6.025462 -0.942087 -0.42997
H  -3.877223 0.936281 2.750062
H  -7.83288 -1.529313 1.135727
H  -5.687556 0.362191 4.315755
H  -7.674648 -0.876552 3.516111
totalener: -1079.73258616 hartree
nucrepener: 2035.02133593 hartree
electener: -3114.75392210 hartree
oneelecener: -5508.46389295 hartree
twoeener: 2393.70997085 hartree
kineticenergy: 1074.90785767 hartree
xcener: -106.464889035070 hartree
chargesum: 0.0000000
charge: -0.260104 -0.413447 -0.254079 0.081495 -0.033267 -0.088834 -0.244848 -0.272915 -0.187129 0.369458 -0.028064 -0.211597 -0.236443 0.058914 -0.075586 -0.253960 -0.034913 0.220919 -0.137280 0.095092 -0.155543 -0.170478 -0.123521 -0.121139 -0.135448 0.106541 0.079183 0.085788 0.081951 0.094336 0.089195 0.105328 0.081644 0.090232 0.079207 0.086105 0.083681 0.096193 0.081001 0.085334 0.112589 0.094645 0.151273 0.133525 0.102909 0.105391 0.106790 0.109263 0.122932 0.123655 0.124025
qa: -0.2601 -0.4134 -0.2541 0.0815 -0.0333 -0.0888 -0.2448 -0.2729 -0.1871 0.3695 -0.0281 -0.2116 -0.2364 0.0589 -0.0756 -0.2540 -0.0349 0.2209 -0.1373 0.0951 -0.1555 -0.1705 -0.1235 -0.1211 -0.1354 0.1065 0.0792 0.0858 0.0820 0.0943 0.0892 0.1053 0.0816 0.0902 0.0792 0.0861 0.0837 0.0962 0.0810 0.0853 0.1126 0.0946 0.1513 0.1335 0.1029 0.1054 0.1068 0.1093 0.1229 0.1237 0.1240
va: 2.1376 2.0799 2.3136 3.7129 3.8190 3.8755 3.9094 3.9042 3.8511 4.2082 3.7367 3.9402 3.9379 3.8946 3.7510 4.0367 3.9982 3.6262 3.8837 3.6070 4.0130 4.0073 3.9563 3.9613 3.9622 1.0271 1.0346 1.0028 1.0074 1.0054 1.0028 1.0208 1.0020 1.0133 1.0105 0.9978 0.9990 1.0023 1.0115 0.9999 1.0076 0.9984 1.0215 1.0070 1.0080 1.0099 1.0141 1.0114 1.0004 1.0004 1.0000
dispcorr: -0.022462705 hartree
energy: -1079.755048869646
dipole: 29.80599 -29.41383 0.39216 15.39573 -15.42450 -0.02876 -8.74888 8.32593 -0.42295
magnitude: 0.57750 au
magnitude: 1.46789 debye
