program: Orca
programVersion: 5.0.2
elementType: O O O C C C C C C C C C C C C C C C C C C C C C C H H H H H H H H H H H H H H H H H H H H H H H H H H
charge: 0
multiplicity: 1
keywords: wb97x-d3
keywords: def2-TZVPP
keywords: def2/J RIJCOSX
keywords: DEFGRID2
keywords: scfconv7
keywords: smallprint printgap noloewdin
keywords: NOSOSCF
formula: C22H26O3
InChI: InChI=1/C22H26O3/c1-15(2)10-19-20(22(19,3)4)21(23)25-14-17-12-18(24-13-17)11-16-8-6-5-7-9-16/h5-10,12-13,19-20H,11,14H2,1-4H3
51 atoms
O  1.594788 -1.913446 -0.542808
O  0.802112 -0.455968 -2.044629
O  -2.87333 -1.993817 -0.27945
C  2.101928 1.510831 0.109365
C  2.816545 1.533836 -1.200595
C  2.537246 0.20528 -0.536287
C  2.852034 1.896037 1.362014
C  0.641777 1.889755 0.15053
C  4.20836 2.033503 -1.336914
C  1.55078 -0.717259 -1.139854
C  5.068631 1.645083 -2.278901
C  6.448544 2.223147 -2.365278
C  4.734176 0.620134 -3.319352
C  0.615555 -2.872876 -0.942984
C  -0.72803 -2.539898 -0.402039
C  -1.100432 -2.409114 0.973754
C  -1.849131 -2.26462 -1.105585
C  -2.412227 -2.074812 0.986868
C  -3.356421 -1.740483 2.081205
C  -3.831508 -0.304025 2.058432
C  -5.116193 0.014214 2.48291
C  -2.992758 0.725164 1.644271
C  -5.555328 1.329771 2.497774
C  -3.428716 2.040608 1.655166
C  -4.711988 2.34854 2.081783
H  2.171682 1.724376 -2.05472
H  3.373445 -0.285482 -0.050707
H  2.840947 2.979103 1.502286
H  3.893339 1.575095 1.341611
H  2.385935 1.445838 2.239999
H  0.141297 1.408457 0.993677
H  0.106773 1.618411 -0.757009
H  0.544381 2.968984 0.283945
H  4.529757 2.791712 -0.628723
H  7.207662 1.441093 -2.284266
H  6.609945 2.713472 -3.328564
H  6.636647 2.955864 -1.581378
H  3.726388 0.222674 -3.219037
H  4.825854 1.044824 -4.322273
H  5.432604 -0.219485 -3.274454
H  0.977909 -3.816481 -0.534365
H  0.582628 -2.9669 -2.030395
H  -0.465872 -2.537299 1.836262
H  -2.046861 -2.212557 -2.163708
H  -2.851342 -1.946517 3.028738
H  -4.223119 -2.407572 2.050478
H  -5.785655 -0.776446 2.801453
H  -1.991661 0.49726 1.298312
H  -6.56064 1.557203 2.827659
H  -2.763316 2.826876 1.322514
H  -5.054278 3.374979 2.084692
totalener: -1079.73092943 hartree
nucrepener: 2125.94595246 hartree
electener: -3205.67688190 hartree
oneelecener: -5690.22952564 hartree
twoeener: 2484.55264374 hartree
kineticenergy: 1074.91884218 hartree
xcener: -106.468743434516 hartree
chargesum: 0.0000000
charge: -0.262896 -0.382416 -0.245792 0.161128 -0.033573 -0.100387 -0.283458 -0.288428 -0.232882 0.336918 -0.004127 -0.211544 -0.227207 0.063405 -0.055945 -0.289570 0.010604 0.193794 -0.092789 0.023441 -0.133915 -0.112703 -0.133594 -0.145650 -0.116328 0.104866 0.081106 0.091987 0.083413 0.091338 0.081673 0.107957 0.090822 0.093195 0.084043 0.086297 0.077975 0.081231 0.088737 0.083389 0.105077 0.103075 0.127464 0.137234 0.091822 0.092420 0.104627 0.105580 0.122517 0.122340 0.123730
qa: -0.2629 -0.3824 -0.2458 0.1611 -0.0336 -0.1004 -0.2835 -0.2884 -0.2329 0.3369 -0.0041 -0.2115 -0.2272 0.0634 -0.0559 -0.2896 0.0106 0.1938 -0.0928 0.0234 -0.1339 -0.1127 -0.1336 -0.1456 -0.1163 0.1049 0.0811 0.0920 0.0834 0.0913 0.0817 0.1080 0.0908 0.0932 0.0840 0.0863 0.0780 0.0812 0.0887 0.0834 0.1051 0.1031 0.1275 0.1372 0.0918 0.0924 0.1046 0.1056 0.1225 0.1223 0.1237
va: 2.1228 2.1158 2.3173 3.7376 3.8469 3.8303 3.9082 3.8898 3.8988 4.2115 3.7317 3.9411 3.9432 3.8994 3.6616 4.0087 3.9797 3.6536 3.8831 3.7609 3.9642 3.9638 3.9749 3.9730 3.9550 1.0272 1.0333 1.0003 1.0045 1.0067 1.0018 1.0166 1.0037 1.0084 0.9990 0.9984 1.0098 1.0220 1.0015 1.0007 0.9884 1.0087 1.0192 1.0107 1.0011 1.0078 1.0100 1.0020 1.0010 1.0024 1.0003
dispcorr: -0.024508990 hartree
energy: -1079.755438422829
dipole: 22.83141 -22.38660 0.44481 14.38597 -14.58288 -0.19691 -1.99362 2.52241 0.52879
magnitude: 0.71850 au
magnitude: 1.82628 debye
