program: Orca
programVersion: 5.0.2
elementType: O O O C C C C C C C C C C C C C C C C C C C C C C H H H H H H H H H H H H H H H H H H H H H H H H H H
charge: 0
multiplicity: 1
keywords: wb97x-d3
keywords: def2-TZVPP
keywords: def2/J RIJCOSX
keywords: DEFGRID2
keywords: scfconv7
keywords: smallprint printgap noloewdin
keywords: NOSOSCF
formula: C22H26O3
InChI: InChI=1/C22H26O3/c1-15(2)10-19-20(22(19,3)4)21(23)25-14-17-12-18(24-13-17)11-16-8-6-5-7-9-16/h5-10,12-13,19-20H,11,14H2,1-4H3
51 atoms
O  1.733974 -2.042585 -0.047793
O  1.14717 -1.226656 -2.048858
O  -2.595618 -2.356952 -0.347524
C  1.116431 1.380089 -0.24068
C  2.188033 1.442835 -1.279744
C  2.093359 0.222173 -0.399901
C  1.266948 2.187646 1.025712
C  -0.32228 1.233582 -0.676696
C  3.349823 2.362167 -1.164584
C  1.615467 -1.061039 -0.952895
C  4.575474 2.110995 -1.626753
C  5.682811 3.11163 -1.490299
C  4.947088 0.835112 -2.318582
C  0.958931 -3.220811 -0.285253
C  -0.474783 -2.919451 -0.03005
C  -1.056174 -2.556363 1.226027
C  -1.461739 -2.769565 -0.942427
C  -2.340529 -2.217632 0.971443
C  -3.412585 -1.628966 1.817844
C  -3.432922 -0.12282 1.692397
C  -2.728891 0.669023 2.592703
C  -4.103455 0.494529 0.64221
C  -2.698402 2.048331 2.452689
C  -4.073796 1.873395 0.498019
C  -3.370635 2.655056 1.402354
H  1.833909 1.272807 -2.293862
H  2.824366 0.131103 0.395984
H  0.680811 1.740122 1.830172
H  0.897757 3.205117 0.879242
H  2.301709 2.254282 1.362283
H  -0.914305 0.716016 0.08098
H  -0.42701 0.692718 -1.614206
H  -0.766145 2.221381 -0.812954
H  3.167525 3.323113 -0.691695
H  6.52951 2.688391 -0.9439
H  6.0646 3.412507 -2.469165
H  5.360726 4.010624 -0.966005
H  4.115991 0.138316 -2.402321
H  5.313768 1.038511 -3.327916
H  5.760437 0.329781 -1.791447
H  1.345392 -3.956763 0.4193
H  1.114013 -3.601897 -1.295842
H  -0.565616 -2.528587 2.185898
H  -1.488995 -2.899311 -2.011705
H  -3.230974 -1.9149 2.855065
H  -4.384655 -2.04661 1.544048
H  -2.197248 0.202233 3.413782
H  -4.650541 -0.10801 -0.072469
H  -2.149286 2.649478 3.165705
H  -4.601277 2.338515 -0.324402
H  -3.34973 3.731095 1.291164
totalener: -1079.72961917 hartree
nucrepener: 2203.24588284 hartree
electener: -3282.97550202 hartree
oneelecener: -5845.04266183 hartree
twoeener: 2562.06715981 hartree
kineticenergy: 1074.91595811 hartree
xcener: -106.467640379237 hartree
chargesum: 0.0000000
charge: -0.265521 -0.381790 -0.251670 0.186385 -0.026594 -0.105547 -0.292481 -0.241837 -0.242400 0.321820 -0.005185 -0.212010 -0.225513 0.066137 -0.063731 -0.282276 0.004428 0.220088 -0.136981 0.073686 -0.150028 -0.144172 -0.141395 -0.121515 -0.132437 0.106118 0.080738 0.085340 0.089678 0.087718 0.054732 0.099655 0.086515 0.091967 0.083200 0.086336 0.077848 0.082916 0.088902 0.083166 0.103387 0.105221 0.121515 0.141688 0.098371 0.108806 0.102281 0.111037 0.124967 0.123752 0.124687
qa: -0.2655 -0.3818 -0.2517 0.1864 -0.0266 -0.1055 -0.2925 -0.2418 -0.2424 0.3218 -0.0052 -0.2120 -0.2255 0.0661 -0.0637 -0.2823 0.0044 0.2201 -0.1370 0.0737 -0.1500 -0.1442 -0.1414 -0.1215 -0.1324 0.1061 0.0807 0.0853 0.0897 0.0877 0.0547 0.0997 0.0865 0.0920 0.0832 0.0863 0.0778 0.0829 0.0889 0.0832 0.1034 0.1052 0.1215 0.1417 0.0984 0.1088 0.1023 0.1110 0.1250 0.1238 0.1247
va: 2.1107 2.1168 2.3005 3.6920 3.8410 3.8230 3.9105 3.9004 3.9022 4.2470 3.7313 3.9417 3.9408 3.8997 3.7087 4.0257 3.9697 3.6076 3.8757 3.6190 3.9428 3.9873 3.9347 3.9490 3.9267 1.0254 1.0331 1.0094 1.0007 1.0072 1.0040 1.0253 1.0055 1.0093 0.9993 0.9983 1.0098 1.0203 1.0014 1.0011 0.9913 1.0107 1.0207 1.0114 1.0128 1.0125 1.0127 1.0172 1.0004 1.0005 1.0002
dispcorr: -0.027772182 hartree
energy: -1079.757391356822
dipole: 17.21607 -17.17972 0.03635 17.57715 -17.43729 0.13987 -1.11907 1.84850 0.72943
magnitude: 0.74360 au
magnitude: 1.89009 debye
