program: Orca
programVersion: 5.0.2
elementType: O O O C C C C C C C C C C C C C C C C C C C C C C H H H H H H H H H H H H H H H H H H H H H H H H H H
charge: 0
multiplicity: 1
keywords: wb97x-d3
keywords: def2-TZVPP
keywords: def2/J RIJCOSX
keywords: DEFGRID2
keywords: scfconv7
keywords: smallprint printgap noloewdin
keywords: NOSOSCF
formula: C22H26O3
InChI: InChI=1/C22H26O3/c1-15(2)10-19-20(22(19,3)4)21(23)25-14-17-12-18(24-13-17)11-16-8-6-5-7-9-16/h5-10,12-13,19-20H,11,14H2,1-4H3
51 atoms
O  1.073092 -1.43198 -1.413616
O  2.409746 -2.584309 -0.040624
O  -1.638123 -3.277161 1.549055
C  2.235193 0.972046 0.191119
C  2.691256 0.938259 -1.239162
C  2.859947 -0.288062 -0.38246
C  3.076078 1.717923 1.19833
C  0.757057 1.04124 0.488807
C  3.889881 1.68429 -1.701958
C  2.109539 -1.551211 -0.57687
C  3.872701 2.940004 -2.150523
C  5.119681 3.623739 -2.622051
C  2.623657 3.764487 -2.225057
C  0.200992 -2.559017 -1.531185
C  -0.716795 -2.646378 -0.366022
C  -1.772498 -1.738581 -0.034848
C  -0.684389 -3.549541 0.639722
C  -2.291037 -2.166968 1.138879
C  -3.389708 -1.652372 2.002824
C  -3.771168 -0.249681 1.612549
C  -4.940073 0.008052 0.908746
C  -2.930894 0.815673 1.926036
C  -5.268944 1.30222 0.527667
C  -3.254501 2.108004 1.547843
C  -4.427103 2.355445 0.846398
H  1.884417 0.874901 -1.962993
H  3.862961 -0.485881 -0.018618
H  4.142464 1.641467 0.990818
H  2.901388 1.333494 2.204648
H  2.821612 2.779786 1.196601
H  0.454773 2.08386 0.609085
H  0.51682 0.519384 1.417199
H  0.14117 0.611761 -0.29648
H  4.839319 1.157031 -1.67903
H  5.023981 3.943043 -3.662973
H  5.317991 4.525715 -2.037649
H  5.993779 2.977867 -2.549686
H  1.754698 3.255836 -1.812046
H  2.748548 4.70419 -1.681404
H  2.395833 4.034201 -3.259594
H  0.77365 -3.479741 -1.650882
H  -0.352819 -2.381844 -2.452882
H  -2.092844 -0.874538 -0.594445
H  -0.041559 -4.391341 0.838823
H  -3.07113 -1.676364 3.049595
H  -4.262934 -2.309382 1.938854
H  -5.602163 -0.81095 0.653953
H  -2.009528 0.627815 2.46502
H  -6.185222 1.485651 -0.018261
H  -2.590881 2.924567 1.801298
H  -4.682607 3.364974 0.552506
totalener: -1079.72906281 hartree
nucrepener: 2144.79754810 hartree
electener: -3224.52661091 hartree
oneelecener: -5727.72449097 hartree
twoeener: 2503.19788006 hartree
kineticenergy: 1074.91593605 hartree
xcener: -106.468258255605 hartree
chargesum: -0.0000000
charge: -0.266464 -0.369212 -0.254784 0.136009 0.008505 -0.121006 -0.246893 -0.304149 -0.217892 0.348855 -0.021781 -0.212096 -0.236787 0.036506 -0.053347 -0.312151 0.011048 0.198548 -0.063916 0.029242 -0.140512 -0.181608 -0.124864 -0.111985 -0.129336 0.101209 0.081009 0.081885 0.096603 0.083311 0.085266 0.096738 0.087984 0.091237 0.085360 0.083806 0.079702 0.078730 0.083899 0.095254 0.107919 0.102141 0.144099 0.144144 0.103147 0.086096 0.108530 0.117961 0.125087 0.123650 0.125300
qa: -0.2665 -0.3692 -0.2548 0.1360 0.0085 -0.1210 -0.2469 -0.3041 -0.2179 0.3489 -0.0218 -0.2121 -0.2368 0.0365 -0.0533 -0.3122 0.0110 0.1985 -0.0639 0.0292 -0.1405 -0.1816 -0.1249 -0.1120 -0.1293 0.1012 0.0810 0.0819 0.0966 0.0833 0.0853 0.0967 0.0880 0.0912 0.0854 0.0838 0.0797 0.0787 0.0839 0.0953 0.1079 0.1021 0.1441 0.1441 0.1031 0.0861 0.1085 0.1180 0.1251 0.1237 0.1253
va: 2.1006 2.1366 2.3080 3.7036 3.7737 3.9036 3.9051 3.9115 3.8640 4.2767 3.7357 3.9417 3.9425 3.9120 3.6847 3.9858 3.9938 3.6576 3.8520 3.6645 3.9738 3.9816 3.9634 3.9415 3.9606 1.0214 1.0327 1.0082 1.0041 1.0036 1.0032 1.0016 1.0154 1.0148 0.9978 0.9987 1.0108 1.0111 1.0007 1.0011 1.0095 0.9924 1.0047 1.0115 1.0070 1.0073 1.0114 1.0065 1.0005 1.0016 0.9997
dispcorr: -0.025777478 hartree
energy: -1079.754840287714
dipole: 14.08038 -14.63033 -0.54995 25.23702 -24.23253 1.00449 -5.43701 5.09383 -0.34318
magnitude: 1.19550 au
magnitude: 3.03872 debye
